{"text_format":"1","workbook":"xlsx","n_sheets":3,"sheets":["Sheet1","Sheet2","Sheet3"],"not_rendered":{"charts":0,"images":1,"macros":1,"external_links":0,"defined_names":2,"comments":0,"pivot_tables":0},"unopened":[],"bounds":{"document_bytes":16777216,"sheet_cells":100000,"rows_first":2000,"rows_last":500,"rows_between":2000,"halvings":0,"cell_chars":16384,"cell_head_chars":4096},"cells_cut":0,"cells_raw":0,"read":"whole","date_system":"1900"}

{"sheet":"Sheet1","index":0,"n_rows":86,"n_cols":49,"rows_kept":86,"cut":false,"hidden":false,"merged":[[2,4,2,7],[7,2,8,7],[0,0,1,7],[12,0,12,1]]}
["فرم پیش خبر کتابخانه های عمومی استان مرکزی",null,null,null,null,null,null,null,null,null,null,null,null,null,null,null,null,null,null,null,null,null,null,null,null,null,null,null,null,null,null,null,null,null,null,null,null,null,null,null,null,null,null,null,null,"کتابخانه",null,"کد","شهرستان"]
[null,null,null,null,null,null,null,null,null,null,null,null,null,null,null,null,null,null,null,null,null,null,null,null,null,null,null,null,null,null,null,8,null,null,null,null,null,null,null,null,null,null,null,null,null,"کتابخانه عمومی آیت الله اراکی شهر اراک",null,127001,"اراک"]
["شهرستان :",null,null,"کتابخانه :",null,null,null,null,null,null,null,null,null,null,null,null,null,null,null,null,null,null,null,null,null,null,null,null,null,1398,null,9,null,null,null,null,null,null,null,null,null,null,null,{"$f":"AND(ISTEXT(B3),ISTEXT(E3),ISTEXT(D6),ISNUMBER(F6),ISNUMBER(H6),ISTEXT(C8))","v":false},null,"کتابخانه عمومی آیت الله مقدسی شهر محلات",null,127002,"محلات"]
[null,null,null,null,null,null,null,null,null,null,null,null,null,null,null,null,null,null,null,null,null,null,null,null,null,null,null,null,null,1399,null,10,null,null,null,null,null,null,null,null,null,null,null,null,null,"کتابخانه عمومی استاد دهگان شهر اراک",null,127003,"اراک"]
[null,null,null,null,null,null,null,null,null,null,null,null,null,null,null,null,null,"آشتیان",null,null,null,null,null,null,null,null,null,null,null,1400,null,11,null,null,null,null,null,null,null,null,null,null,null,null,null,"کتابخانه عمومی ابوذر غفاری روستای دهنو شهرستان خمین",null,127004,"خمین"]
["سال :",null,"ماه : ",null,"روز: ",null,"ساعت : ",null,null,null,null,null,null,null,null,null,null,"اراک",null,null,null,null,null,null,null,null,null,null,null,1401,null,12,null,null,null,null,null,null,null,null,null,null,null,null,null,"کتابخانه عمومی ادیب الممالک شهر جاورسیان شهرستان خنداب",null,127005,"خنداب"]
[null,null,null,null,null,null,null,null,null,null,null,null,null,null,null,null,null,"تفرش",null,null,null,null,null,null,null,null,null,null,null,1402,null,13,null,null,null,null,null,null,null,null,null,null,null,null,null,"کتابخانه عمومی اشراق شهر دلیجان",null,127006,"دلیجان"]
[null,"عنوان برنامه :",null,null,null,null,null,null,null,null,null,null,null,null,null,null,null,"خمین",null,null,null,null,null,null,null,null,null,null,null,1403,null,14,null,null,null,null,null,null,null,null,null,null,null,null,null,"کتابخانه عمومی الغدیر روستای راونج شهرستان دلیجان",null,127007,"دلیجان"]
[null,null,null,null,null,null,null,null,null,null,null,null,null,null,null,null,null,"خنداب",null,null,null,null,null,null,null,null,null,null,null,1404,null,15,null,null,null,null,null,null,null,null,null,null,null,null,null,"کتابخانه عمومی امام خمینی(ره) کرهرود شهر اراک",null,127008,"اراک"]
[null,null,null,null,null,null,null,null,null,null,null,null,null,null,null,null,null,"دلیجان",null,null,null,null,null,null,null,null,null,null,null,null,null,16,null,null,null,null,null,null,null,null,null,null,null,null,null,"کتابخانه عمومی امام خمینی(ره) روستای قدمگاه شهرستان شازند",null,127009,"شازند"]
[null,null,null,null,null,null,null,null,null,null,null,null,null,null,null,null,null,"زرندیه",null,null,null,null,null,null,null,null,null,null,null,null,null,17,null,null,null,null,null,null,null,null,null,null,null,null,null,"کتابخانه عمومی امام خمینی(ره) روستای گرکان شهرستان آشتیان",null,127010,"آشتیان"]
[null,null,null,null,null,null,null,null,null,null,null,null,null,null,null,null,null,"ساوه",null,null,null,null,null,null,null,null,null,null,null,null,null,18,null,null,null,null,null,null,null,null,null,null,null,null,null,"کتابخانه عمومی امام صادق(ع) شهر نیم ور شهرستان محلات",null,127011,"محلات"]
["Written by Mohsen Heydari   ",null,null,null,null,null,null,null,null,null,null,null,null,null,null,null,null,"شازند",null,null,null,null,null,null,null,null,null,null,null,null,null,null,null,null,null,null,null,null,null,null,null,null,null,null,null,"کتابخانه عمومی امام علی(ع) شهر مامونیه شهرستان زرندیه",null,127012,"زرندیه"]
[null,null,null,null,null,null,null,null,null,null,null,null,null,null,null,null,null,"فراهان",null,null,null,null,null,null,null,null,null,null,null,null,null,null,null,null,null,null,null,null,null,null,null,null,null,null,null,"کتابخانه عمومی فاضلین نراقی شهر نراق شهرستان دلیجان",null,127013,"دلیجان"]
[null,null,null,null,null,null,null,null,null,null,null,null,null,null,null,null,null,"کمیجان",null,null,null,null,null,null,null,null,null,null,null,null,null,null,null,null,null,null,null,null,null,null,null,null,null,null,null,"کتابخانه عمومی امیرالمومنین(ع) شهر آستانه شهرستان شازند",null,127014,"شازند"]
[null,null,null,null,null,null,null,null,null,null,null,null,null,null,null,null,null,"محلات",null,null,null,null,null,null,null,null,null,null,null,null,null,null,null,null,null,null,null,null,null,null,null,null,null,null,null,"کتابخانه عمومی پروفسور حسابی شهرستان تفرش",null,127016,"تفرش"]
[null,null,null,null,null,null,null,null,null,null,null,null,null,null,null,null,null,null,null,null,null,null,null,null,null,null,null,null,null,null,null,null,null,null,null,null,null,null,null,null,null,null,null,null,null,"کتابخانه عمومی توحید روستای اناج شهرستان خنداب",null,127017,"خنداب"]
[null,null,null,null,null,null,null,null,null,null,null,null,"آشتیان","اراک","تفرش","خمین","خنداب","دلیجان","زرندیه","ساوه","شازند","فراهان","کمیجان","محلات",null,null,"فروردین","اردیبهشت","خرداد","تیر","مرداد","شهریور","مهر","آبان","آذر","دی","بهمن","اسفند",null,null,null,null,null,null,null,"کتابخانه عمومی شهید هاشمی شهر خنجین شهرستان فراهان",null,127018,"فراهان"]
[null,null,null,null,null,null,null,null,null,null,null,{"$f":"IF(HLOOKUP($B$3,$M$18:$X$50,ROW()-17,FALSE)=0,\"\",HLOOKUP($B$3,$M$18:$X$50,ROW()-17,FALSE))","v":{"$error":"#N/A"}},"کتابخانه عمومی عباس اقبال آشتیانی شهر آشتیان","کتابخانه عمومی شماره یک شهر اراک","کتابخانه عمومی پروفسور حسابی شهرستان تفرش","کتابخانه عمومی ابوذر غفاری روستای دهنو شهرستان خمین","کتابخانه عمومی معراج شهر خنداب","کتابخانه عمومی اشراق شهر دلیجان","کتابخانه عمومی امام علی(ع) شهر مامونیه شهرستان زرندیه","کتابخانه عمومی شهید هاشمی نژاد شهر ساوه","کتابخانه عمومی شهید سیاوش امیری شهر شازند"," کتابخانه عمومی ولایت شهر فرمهین شهرستان فراهان","کتابخانه عمومی فخرالدین عراقی شهر کمیجان","کتابخانه عمومی علامه طباطبایی شهر محلات",null,null,1,1,1,1,1,1,1,1,1,1,1,1,null,null,null,null,null,null,null,"کتابخانه عمومی شهدای روستای خیرآباد شهرستان اراک",null,127019,"اراک"]
[null,null,null,null,null,null,null,null,null,null,null,{"$f":"IF(HLOOKUP($B$3,$M$18:$X$50,ROW()-17,FALSE)=0,\"\",HLOOKUP($B$3,$M$18:$X$50,ROW()-17,FALSE))","v":{"$error":"#N/A"}},"کتابخانه عمومی امام خمینی(ره) روستای گرکان شهرستان آشتیان","کتابخانه عمومی استاد دهگان شهر اراک",null,"کتابخانه عمومی شهید مصطفی خمینی روستای شهابیه شهرستان خمین","کتابخانه عمومی ادیب الممالک شهر جاورسیان شهرستان خنداب","کتابخانه عمومی فاضلین نراقی شهر نراق شهرستان دلیجان","کتابخانه عمومی شهدای شهر پرندک شهرستان زرندیه","کتابخانه عمومی سلمان ساوجی شهر ساوه","کتابخانه عمومی امیرالمومنین(ع) شهر آستانه شهرستان شازند","کتابخانه عمومی قائم مقام فراهانی شهر فرمهین شهرستان فراهان","کتابخانه عمومی شادروان محمودی شهر میلاجرد شهرستان کمیجان","کتابخانه عمومی آیت الله مقدسی شهر محلات",null,null,2,2,2,2,2,2,2,2,2,2,2,2,null,null,null,null,null,null,null,"کتابخانه عمومی شهدای شهر داودآباد شهرستان اراک",null,127020,"اراک"]
[null,null,null,null,null,null,null,null,null,null,null,{"$error":"#N/A"},"کتابخانه عمومی حضرت سیدالشهداء(ع) روستای کردیجان شهرستان آشتیان","کتابخانه عمومی حجت الاسلام میرجعفری شهر اراک",null,"کتابخانه عمومی شهدای شهر قورچی باشی شهرستان خمین","کتابخانه عمومی توحید روستای اناج شهرستان خنداب","کتابخانه عمومی الغدیر روستای راونج شهرستان دلیجان","کتابخانه عمومی شهدای روستای علیشار شهرستان زرندیه","کتابخانه عمومی حضرت ولیعصر(عج) شهر ساوه","کتابخانه عمومی شهدای شهر هندودر شهرستان شازند","کتابخانه عمومی شهید نبی الله روستای ونک شهرستان فراهان","کتابخانه عمومی شهدای روستای اسفندان شهرستان کمیجان","کتابخانه عمومی امام صادق(ع) شهر نیم ور شهرستان محلات",null,null,3,3,3,3,3,3,3,3,3,3,3,3,null,null,null,null,null,null,null,"کتابخانه عمومی دکتر مهین حصیبی شهر اراک",null,127021,"اراک"]
[null,null,null,null,null,null,null,null,null,null,null,{"$error":"#N/A"},null,"کتابخانه عمومی دکتر مهین حصیبی شهر اراک",null,"کتابخانه عمومی سرداران شهید شهر خمین",null,"کتابخانه عمومی علامه عبدالهادی دلیجانی شهر دلیجان","کتابخانه عمومی امام حسن مجتبی(ع) شهر زاویه شهرستان زرندیه","کتابخانه عمومی علامه عسگری شهر ساوه","کتابخانه عمومی شهدای شهر شازند","کتابخانه عمومی شهید هاشمی شهر خنجین شهرستان فراهان","کتابخانه عمومی شیخ عبدالنبی وفسی روستای وفس شهرستان کمیجان",null,null,null,4,4,4,4,4,4,4,4,4,4,4,4,null,null,null,null,null,null,null,"کتابخانه عمومی امام سجاد(ع) روستای ستق شهرستان ساوه",null,127022,"ساوه"]
[null,null,null,null,null,null,null,null,null,null,null,{"$error":"#N/A"},null,"کتابخانه عمومی آیت الله اراکی شهر اراک",null,"کتابخانه عمومی شهید بهشتی شهر خمین",null,null,"کتابخانه عمومی باقرالعلوم(ع) شهر خشکرود شهرستان زرندیه","کتابخانه عمومی شهید چمران شهر غرق آباد شهرستان ساوه","کتابخانه عمومی شهید مطهری شهر مهاجران شهرستان شازند","کتابخانه عمومی امام رضا(ع) شهر تلخاب شهرستان فراهان","کتابخانه عمومی حضرت زینب(س) روستای خسروبیگ شهرستان کمیجان",null,null,null,5,5,5,5,5,5,5,5,5,5,5,5,null,null,null,null,null,null,null,"کتابخانه عمومی سرداران شهید شهر خمین",null,127023,"خمین"]
[null,null,null,null,null,null,null,null,null,null,null,{"$error":"#N/A"},null,"کتابخانه عمومی حضرت امام حسین(ع) شهر اراک",null,"کتابخانه عمومی صاحب الزمان(عج) روستای رباط مراد شهرستان خمین",null,null,null,"کتابخانه عمومی شهید نظرفخاری شهر نوبران شهرستان ساوه","کتابخانه عمومی شهدای بازنه شهر شهباز شهرستان شازند",null,null,null,null,null,6,6,6,6,6,6,6,6,6,6,6,6,null,null,null,null,null,null,null,"کتابخانه عمومی شهید سیاوش امیری شهر شازند",null,127024,"شازند"]
[null,null,null,null,null,null,null,null,null,null,null,{"$error":"#N/A"},null,"کتابخانه عمومی علی بن ابیطالب(ع) شهر اراک",null,null,null,null,null,"کتابخانه عمومی امام سجاد(ع) روستای ستق شهرستان ساوه","کتابخانه عمومی ملاصدرای شهر شهباز شهرستان شازند",null,null,null,null,null,7,7,7,7,7,7,7,7,7,7,7,7,null,null,null,null,null,null,null,"کتابخانه عمومی سلمان ساوجی شهر ساوه",null,127025,"ساوه"]
[null,null,null,null,null,null,null,null,null,null,null,{"$error":"#N/A"},null,"کتابخانه عمومی شهدای شهرک ولیعصر(عج) شهر اراک",null,null,null,null,null,null,"کتابخانه عمومی شهدای شهر توره شهرستان شازند",null,null,null,null,null,8,8,8,8,8,8,8,8,8,8,8,8,null,null,null,null,null,null,null,"کتابخانه عمومی شهدای سنجان شهر اراک",null,127026,"اراک"]
[null,null,null,null,null,null,null,null,null,null,null,{"$error":"#N/A"},null,"کتابخانه عمومی امیرالمومنین(ع) شهر اراک",null,null,null,null,null,null,"کتابخانه عمومی شهدای حصار و فر شهرستان شازند",null,null,null,null,null,9,9,9,9,9,9,9,9,9,9,9,9,null,null,null,null,null,null,null,"کتابخانه عمومی شادروان محمودی شهر میلاجرد شهرستان کمیجان",null,127027,"کمیجان"]
[null,null,null,null,null,null,null,null,null,null,null,{"$error":"#N/A"},null,"کتابخانه عمومی شهدای شهر داودآباد شهرستان اراک",null,null,null,null,null,null,"کتابخانه عمومی شهدای روستای نهرمیان شهرستان شازند",null,null,null,null,null,10,10,10,10,10,10,10,10,10,10,10,10,null,null,null,null,null,null,null,"کتابخانه عمومی شماره یک شهر اراک",null,127028,"اراک"]
[null,null,null,null,null,null,null,null,null,null,null,{"$error":"#N/A"},null,"کتابخانه عمومی شهدای سنجان شهر اراک",null,null,null,null,null,null,"کتابخانه عمومی امام خمینی(ره) روستای قدمگاه شهرستان شازند",null,null,null,null,null,11,11,11,11,11,11,11,11,11,11,11,11,null,null,null,null,null,null,null,"کتابخانه عمومی شهدای روستای اسفندان شهرستان کمیجان",null,127029,"کمیجان"]
[null,null,null,null,null,null,null,null,null,null,null,{"$error":"#N/A"},null,"کتابخانه عمومی شهدای روستای خیرآباد شهرستان اراک",null,null,null,null,null,null,"کتابخانه عمومی شهدای روستای مالمیر شهرستان شازند",null,null,null,null,null,12,12,12,12,12,12,12,12,12,12,12,12,null,null,null,null,null,null,null,"کتابخانه عمومی شهدای بازنه شهر شهباز شهرستان شازند",null,127030,"شازند"]
[null,null,null,null,null,null,null,null,null,null,null,{"$error":"#N/A"},null,"کتابخانه عمومی کربلایی کاظم ساروقی شهر ساروق شهرستان اراک",null,null,null,null,null,null,"کتابخانه عمومی حضرت زهرا(س) شهر مهاجران شهرستان شازند",null,null,null,null,null,13,13,13,13,13,13,13,13,13,13,13,13,null,null,null,null,null,null,null,"کتابخانه عمومی شهدای شهر پرندک شهرستان زرندیه",null,127031,"زرندیه"]
[null,null,null,null,null,null,null,null,null,null,null,{"$error":"#N/A"},null,"کتابخانه عمومی شهدای روستای مرزیجران شهرستان اراک",null,null,null,null,null,null,null,null,null,null,null,null,14,14,14,14,14,14,14,14,14,14,14,14,null,null,null,null,null,null,null,"کتابخانه عمومی شهدای حصار و فر شهرستان شازند",null,127032,"شازند"]
[null,null,null,null,null,null,null,null,null,null,null,{"$error":"#N/A"},null,"کتابخانه عمومی شهدای روستای معصومیه شهرستان اراک",null,null,null,null,null,null,null,null,null,null,null,null,15,15,15,15,15,15,15,15,15,15,15,15,null,null,null,null,null,null,null,"کتابخانه عمومی شهدای شهرک ولیعصر(عج) شهر اراک",null,127033,"اراک"]
[null,null,null,null,null,null,null,null,null,null,null,{"$error":"#N/A"},null,"کتابخانه عمومی امام خمینی(ره) کرهرود شهر اراک",null,null,null,null,null,null,null,null,null,null,null,null,16,16,16,16,16,16,16,16,16,16,16,16,null,null,null,null,null,null,null,"کتابخانه عمومی شهدای روستای علیشار شهرستان زرندیه",null,127034,"زرندیه"]
[null,null,null,null,null,null,null,null,null,null,null,{"$error":"#N/A"},null,"کتابخانه عمومی شهید زراستوند شهر اراک",null,null,null,null,null,null,null,null,null,null,null,null,17,17,17,17,17,17,17,17,17,17,17,17,null,null,null,null,null,null,null,"کتابخانه عمومی شهدای روستای مالمیر شهرستان شازند",null,127035,"شازند"]
[null,null,null,null,null,null,null,null,null,null,null,{"$error":"#N/A"},null,"کتابخانه عمومی صاحب الامر(عج) شهر اراک",null,null,null,null,null,null,null,null,null,null,null,null,18,18,18,18,18,18,18,18,18,18,18,18,null,null,null,null,null,null,null,"کتابخانه عمومی شهدای روستای معصومیه شهرستان اراک",null,127036,"اراک"]
[null,null,null,null,null,null,null,null,null,null,null,{"$error":"#N/A"},null,null,null,null,null,null,null,null,null,null,null,null,null,null,19,19,19,19,19,19,19,19,19,19,19,19,null,null,null,null,null,null,null,"کتابخانه عمومی شهدای روستای نهرمیان شهرستان شازند",null,127037,"شازند"]
[null,null,null,null,null,null,null,null,null,null,null,{"$f":"IF(HLOOKUP($B$3,$M$18:$X$50,ROW()-34,FALSE)=0,\"\",HLOOKUP($B$3,$M$18:$X$50,ROW()-34,FALSE))","v":{"$error":"#N/A"}},null,null,null,null,null,null,null,null,null,null,null,null,null,null,20,20,20,20,20,20,20,20,20,20,20,20,null,null,null,null,null,null,null,"کتابخانه عمومی شهدای شهر هندودر شهرستان شازند",null,127038,"شازند"]
[null,null,null,null,null,null,null,null,null,null,null,{"$error":"#N/A"},null,null,null,null,null,null,null,null,null,null,null,null,null,null,21,21,21,21,21,21,21,21,21,21,21,21,null,null,null,null,null,null,null,"کتابخانه عمومی شهدای شهر توره شهرستان شازند",null,127039,"شازند"]
[null,null,null,null,null,null,null,null,null,null,null,{"$error":"#N/A"},null,null,null,null,null,null,null,null,null,null,null,null,null,null,22,22,22,22,22,22,22,22,22,22,22,22,null,null,null,null,null,null,null,"کتابخانه عمومی شهدای شهر شازند",null,127040,"شازند"]
[null,null,null,null,null,null,null,null,null,null,null,{"$error":"#N/A"},null,null,null,null,null,null,null,null,null,null,null,null,null,null,23,23,23,23,23,23,23,23,23,23,23,23,null,null,null,null,null,null,null," کتابخانه عمومی ولایت شهر فرمهین شهرستان فراهان",null,127041,"فراهان"]
[null,null,null,null,null,null,null,null,null,null,null,{"$error":"#N/A"},null,null,null,null,null,null,null,null,null,null,null,null,null,null,24,24,24,24,24,24,24,24,24,24,24,24,null,null,null,null,null,null,null,"کتابخانه عمومی شهید بهشتی شهر خمین",null,127042,"خمین"]
[null,null,null,null,null,null,null,null,null,null,null,{"$error":"#N/A"},null,null,null,null,null,null,null,null,null,null,null,null,null,null,25,25,25,25,25,25,25,25,25,25,25,25,null,null,null,null,null,null,null,"کتابخانه عمومی شهید چمران شهر غرق آباد شهرستان ساوه",null,127043,"ساوه"]
[null,null,null,null,null,null,null,null,null,null,null,{"$error":"#N/A"},null,null,null,null,null,null,null,null,null,null,null,null,null,null,26,26,26,26,26,26,26,26,26,26,26,26,null,null,null,null,null,null,null,"کتابخانه عمومی شهید زراستوند شهر اراک",null,127044,"اراک"]
[null,null,null,null,null,null,null,null,null,null,null,{"$error":"#N/A"},null,null,null,null,null,null,null,null,null,null,null,null,null,null,27,27,27,27,27,27,27,27,27,27,27,27,null,null,null,null,null,null,null,"کتابخانه عمومی شهید مصطفی خمینی روستای شهابیه شهرستان خمین",null,127045,"خمین"]
[null,null,null,null,null,null,null,null,null,null,null,{"$error":"#N/A"},null,null,null,null,null,null,null,null,null,null,null,null,null,null,28,28,28,28,28,28,28,28,28,28,28,28,null,null,null,null,null,null,null,"کتابخانه عمومی شهید نظرفخاری شهر نوبران شهرستان ساوه",null,127046,"ساوه"]
[null,null,null,null,null,null,null,null,null,null,null,{"$error":"#N/A"},null,null,null,null,null,null,null,null,null,null,null,null,null,null,29,29,29,29,29,29,29,29,29,29,29,29,null,null,null,null,null,null,null,"کتابخانه عمومی شهید هاشمی نژاد شهر ساوه",null,127047,"ساوه"]
[null,null,null,null,null,null,null,null,null,null,null,null,null,null,null,null,null,null,null,null,null,null,null,null,null,null,30,30,30,30,30,30,30,30,30,30,30,30,null,null,null,null,null,null,null,"کتابخانه عمومی شهید مطهری شهر مهاجران شهرستان شازند",null,127048,"شازند"]
[null,null,null,null,null,null,null,null,null,null,null,null,null,null,null,null,null,null,null,null,null,null,null,null,null,null,31,31,31,31,31,31,null,null,null,null,null,null,null,null,null,null,null,null,null,"کتابخانه عمومی شیخ عبدالنبی وفسی روستای وفس شهرستان کمیجان",null,127049,"کمیجان"]
[null,null,null,null,null,null,null,null,null,null,null,null,null,null,null,null,null,null,null,null,null,null,null,null,null,null,null,null,null,null,null,null,null,null,null,null,null,null,null,null,null,null,null,null,null,"کتابخانه عمومی صاحب الزمان(عج) روستای رباط مراد شهرستان خمین",null,127050,"خمین"]
[null,null,null,null,null,null,null,null,null,null,null,null,null,null,null,null,null,null,null,null,null,null,null,null,null,null,null,null,null,null,null,null,null,null,null,null,null,null,null,null,null,null,null,null,null,"کتابخانه عمومی عباس اقبال آشتیانی شهر آشتیان",null,127051,"آشتیان"]
[null,null,null,null,null,null,null,null,null,null,null,null,null,null,null,null,null,null,null,null,null,null,null,null,null,null,null,null,null,null,null,null,null,null,null,null,null,null,null,null,null,null,null,null,null,"کتابخانه عمومی علامه طباطبایی شهر محلات",null,127052,"محلات"]
[null,null,null,null,null,null,null,null,null,null,null,null,null,null,null,null,null,null,null,null,null,null,null,null,null,null,null,null,null,null,null,null,null,null,null,null,null,null,null,null,null,null,null,null,null,"کتابخانه عمومی علامه عسگری شهر ساوه",null,127053,"ساوه"]
[null,null,null,null,null,null,null,null,null,null,null,null,null,null,null,null,null,null,null,null,null,null,null,null,null,null,null,null,null,null,null,null,null,null,null,null,null,null,null,null,null,null,null,null,null,"کتابخانه عمومی فخرالدین عراقی شهر کمیجان",null,127054,"کمیجان"]
[null,null,null,null,null,null,null,null,null,null,null,null,null,null,null,null,null,null,null,null,null,null,null,null,null,null,{"$f":"IF(HLOOKUP($D$6,$AA$18:$AL$50,ROW()-53,FALSE)=0,\"\",HLOOKUP($D$6,$AA$18:$AL$50,ROW()-53,FALSE))","v":{"$error":"#N/A"}},null,null,null,null,null,null,null,null,null,null,null,null,null,null,null,null,null,null,"کتابخانه عمومی قائم مقام فراهانی شهر فرمهین شهرستان فراهان",null,127055,"فراهان"]
[null,null,null,null,null,null,null,null,null,null,null,null,null,null,null,null,null,null,null,null,null,null,null,null,null,null,{"$error":"#N/A"},null,null,null,null,null,null,null,null,null,null,null,null,null,null,null,null,null,null,"کتابخانه عمومی شهدای شهر قورچی باشی شهرستان خمین",null,127056,"خمین"]
[null,null,null,null,null,null,null,null,null,null,null,null,null,null,null,null,null,null,null,null,null,null,null,null,null,null,{"$error":"#N/A"},null,null,null,null,null,null,null,null,null,null,null,null,null,null,null,null,null,null,"کتابخانه عمومی کربلایی کاظم ساروقی شهر ساروق شهرستان اراک",null,127057,"اراک"]
[null,null,null,null,null,null,null,null,null,null,null,null,null,null,null,null,null,null,null,null,null,null,null,null,null,null,{"$error":"#N/A"},null,null,null,null,null,null,null,null,null,null,null,null,null,null,null,null,null,null,"کتابخانه عمومی شهدای روستای مرزیجران شهرستان اراک",null,127058,"اراک"]
[null,null,null,null,null,null,null,null,null,null,null,null,null,null,null,null,null,null,null,null,null,null,null,null,null,null,{"$error":"#N/A"},null,null,null,null,null,null,null,null,null,null,null,null,null,null,null,null,null,null,"کتابخانه عمومی معراج شهر خنداب",null,127059,"خنداب"]
[null,null,null,null,null,null,null,null,null,null,null,null,null,null,null,null,null,null,null,null,null,null,null,null,null,null,{"$error":"#N/A"},null,null,null,null,null,null,null,null,null,null,null,null,null,null,null,null,null,null,"کتابخانه عمومی ملاصدرای شهر شهباز شهرستان شازند",null,127060,"شازند"]
{"$rows_left_out":27}
{"sheet":"Sheet2","index":1,"n_rows":2,"n_cols":5,"rows_kept":2,"cut":false,"hidden":true,"merged":[]}
["کتابخانه","کد","برگزار كننده","نام برنامه","زمان"]
[{"$f":"VLOOKUP(Sheet1!E3,Sheet1!AT2:AW74,3,FALSE)","v":{"$error":"#N/A"}},{"$f":"VLOOKUP(Sheet1!E3,Sheet1!AT2:AW74,3,FALSE)&Sheet1!B6&(IF(Sheet1!D6=\"فروردین\",\"01\",IF(Sheet1!D6=\"اردیبهشت\",\"02\",IF(Sheet1!D6=\"خرداد\",\"03\",IF(Sheet1!D6=\"تیر\",\"04\",IF(Sheet1!D6=\"مرداد\",\"05\",IF(Sheet1!D6=\"شهریور\",\"06\",IF(Sheet1!D6=\"مهر\",\"07\",IF(Sheet1!D6=\"آبان\",\"08\",IF(Sheet1!D6=\"آذر\",\"09\",IF(Sheet1!D6=\"دی\",\"10\",IF(Sheet1!D6=\"بهمن\",\"11\",IF(Sheet1!D6=\"اسفند\",\"12\")))))))))))))&(IF(Sheet1!F6>9,Sheet1!F6,\"0\"&Sheet1!F6))&(IF(Sheet1!H6>9,Sheet1!H6,\"0\"&Sheet1!H6))","v":{"$error":"#N/A"}},{"$f":"Sheet1!E3","v":0},{"$f":"Sheet1!C8","v":0},{"$f":"Sheet1!F6&\" \"&Sheet1!D6&\" \"&\"ساعت \"&Sheet1!H6","v":"  ساعت "}]

{"sheet":"Sheet3","index":2,"n_rows":1,"n_cols":5,"rows_kept":1,"cut":false,"hidden":true,"merged":[]}
["کتابخانه","کد","برگزار كننده","نام برنامه","زمان"]