{"text_format":"1","workbook":"xlsx","n_sheets":3,"sheets":["menu","data","help"],"not_rendered":{"charts":0,"images":3,"macros":1,"external_links":0,"defined_names":0,"comments":1,"pivot_tables":0},"unopened":[],"bounds":{"document_bytes":16777216,"sheet_cells":100000,"rows_first":2000,"rows_last":500,"rows_between":2000,"halvings":0,"cell_chars":16384,"cell_head_chars":4096},"cells_cut":0,"cells_raw":0,"read":"whole","date_system":"1900"}

{"sheet":"menu","index":0,"n_rows":14,"n_cols":14,"rows_kept":14,"cut":false,"hidden":false,"merged":[[6,3,6,7],[7,9,7,13],[8,9,8,13]]}
[]
[]
[]
[null,null,null,"جستجوی شماره پرسنلی:",null,110]
[null,null,null,"لیست شماره پرسنلی:"]
[]
[null,null,null,"فیش حقوق"]
[null,null,null,"اطلاعات پایه",null,null,"محاسبات"]
[null,null,null,"تاریخ :",{"$f":"VLOOKUP(F4,data!A:G,7,FALSE)","v":"94/01/05"},null,"تعداد فرزند:",{"$f":"VLOOKUP(F4,data!A:G,5,FALSE)","v":2},null,"راههای ارتباط با ما"]
[null,null,null,"شماره:",{"$f":"VLOOKUP(F4,data!A:G,1,FALSE)","v":110},null,"خالص حقوق:",{"$f":"VLOOKUP(F4,data!A:G,6,FALSE)","v":12000000},null,"برای تهیه کتاب ترفندهای اکسل",null,null,"اینجا ","کلیک کنید"]
[null,null,null,"نام وفامیل:",{"$f":"VLOOKUP(F4,data!A:G,2,FALSE)  & \" \" & VLOOKUP(F4,data!A:G,3,FALSE)","v":"احمد  گودرزی"},null,null,null,null,"برای مشاهده وبلاگ ما ",null,null,"اینجا ","کلیک کنید"]
[null,null,null,"حقوق پایه:",{"$f":"VLOOKUP(F4,data!A:G,4,FALSE)","v":450000},null,null,null,null,"برای پیوستن به تلگرام ما",null,null,"اینجا ","کلیک کنید"]
[null,null,null,null,null,null,null,null,null,"برای خرید اپلیکیشن اندرویدی ما",null,null,"اینجا ","کلیک کنید"]
[null,null,null,null,null,null,null,null,null,"جامعه اکسل ایرانیان",null,null,"اینجا ","کلیک کنید"]

{"sheet":"data","index":1,"n_rows":5,"n_cols":7,"rows_kept":5,"cut":false,"hidden":false,"merged":[]}
["کد پرسنلی","نام ","فامیل","حقوق پایه","تعداد فرزند","جمع حقوق","تاریخ "]
[100,"احمد ","خنیفر",250000,1,10000000,"94/01/05"]
[110,"احمد ","گودرزی",450000,2,12000000,"94/01/05"]
[120,"رضا","محمدوند",350000,1,11000000,"94/01/06"]
[130,"محمد حسین","فرح بخش",320000,5,14000000,"94/01/07"]

{"sheet":"help","index":2,"n_rows":6,"n_cols":1,"rows_kept":6,"cut":false,"hidden":false,"merged":[]}
["در این فایل شما روش جستجوی یک شماره را بوسیله تابع vlookup  یاد خواهید گرفت"]
["دو روش جستجو در فایل در نظر گرفته شده است ( جهت آموزش روشهای مختلف )"]
["سلول شماره پرسنلی و کمبو باکس با هم ارتباط دارند در کد برنامه روش ارتباط آنها را ببینید   ( بوسیله کلیدهای alt+f11)"]
[]
["این فایل در 3 شیت و با نام و رنگهای متفاوت ساخته شده است"]
["که تصویر آنها را در  زیر صفحه میبینید "]