{"text_format":"1","workbook":"xlsx","n_sheets":10,"sheets":["جستجو","ناوداني","شكلI","سپري","نبشي_بال_نامساوي","نبشي_بال_مساوي","قوطي_مربع","قوطي_مستطيل","قوطي_دايره","zشكل"],"not_rendered":{"charts":0,"images":0,"macros":1,"external_links":0,"defined_names":38,"comments":0,"pivot_tables":0},"unopened":[],"bounds":{"document_bytes":16777216,"sheet_cells":100000,"rows_first":2000,"rows_last":500,"rows_between":2000,"halvings":0,"cell_chars":16384,"cell_head_chars":4096},"cells_cut":0,"cells_raw":0,"read":"whole","date_system":"1900"}

{"sheet":"جستجو","index":0,"n_rows":181,"n_cols":35,"rows_kept":181,"cut":false,"hidden":false,"merged":[[6,3,7,3],[6,2,7,2],[6,1,7,1],[3,4,3,28],[2,3,2,28]]}
[null,null,null,{"$f":"SUM(E1:AC1)","v":1},{"$f":"IF((ISNUMBER(E5))=TRUE,1,0)","v":0},{"$f":"IF((ISNUMBER(F5))=TRUE,1,0)","v":0},0,0,0,0,0,0,1,0,0,0,0,0,0,{"$f":"IF((ISNUMBER(T5))=TRUE,1,0)","v":0},0,0,0,0,0,0,0,0,0]
[null,null,null,{"$f":"SUM(E2:AC2)","v":9},{"$f":"IF((ISNUMBER(E5))=TRUE,E37,0)","v":0},{"$f":"IF((ISNUMBER(F5))=TRUE,F37,0)","v":0},0,0,0,0,0,0,9,0,0,0,0,0,0,0,0,0,0,0,0,0,0,0,0]
[null,null,"www.amin-r.blog.ir","راهنمای خانه های ابی رنگ : برای یافتن پروفیل مورد نظر بر اساس یکی از مشخصات(مثلا A) ابتدا نوع پروفیل و ردیف را مشخص کرده و عدد مورد نظر را بالای واحد ها در یک خانه آبی رنگ وارد کرده و دکمه GO را زده تا علامت اختصاری مشخص شود(اندازه کوچکتر از عدد وارده انتخاب میشود)"]
[null,null,null,null,{"$f":"IF(D1>1,\"فـقــــط یـکــــی از خـــانــه هــای آبــی رنگ پر شــود\",\"\")","v":""}]
[null,null,null,null,null,null,null,null,null,null,null,null,456]
[null,null,null,null,{"$f":"T(IFERROR(INDEX(INDIRECT($F$28),2,E37),\"\"))","v":""},{"$f":"T(IFERROR(INDEX(INDIRECT($F$28),2,F37),\"\"))","v":""},"","","","","","A","G","ey","y-y","y-y","y-y","z-z",{"$f":"T(IFERROR(INDEX(INDIRECT($F$28),2,S37),\"\"))","v":"z-z"},{"$f":"T(IFERROR(INDEX(INDIRECT($F$28),2,T37),\"\"))","v":"z-z"},"d₁","","","","","",""]
[null,"نوع پروفيل","رديف","علامت اختصاري",{"$f":"T(IFERROR(INDEX(INDIRECT($F$28),3,E37),\"\"))","v":"h"},{"$f":"T(IFERROR(INDEX(INDIRECT($F$28),3,F37),\"\"))","v":"b"},"ts=tg=r1","r2","r3","C","h-c","ديواره","","","Iу","Wy","iy","Iz",{"$f":"T(IFERROR(INDEX(INDIRECT($F$28),3,S37),\"\"))","v":"Wz"},{"$f":"T(IFERROR(INDEX(INDIRECT($F$28),3,T37),\"\"))","v":"iz"},"","","","","","","",{"$f":"IFERROR(INDEX(INDIRECT($F$28),3,AB36),\"\")","v":""},{"$f":"IFERROR(INDEX(INDIRECT($F$28),3,AC36),\"\")","v":""}]
[null,null,null,null,{"$f":"T(IFERROR(INDEX(INDIRECT($F$28),4,E37),\"\"))","v":"mm"},{"$f":"T(IFERROR(INDEX(INDIRECT($F$28),4,F37),\"\"))","v":"mm"},"mm","mm","mm","mm","mm","cm²","kg/m","cm","cm⁴","cm³","cm","cm⁴",{"$f":"T(IFERROR(INDEX(INDIRECT($F$28),4,S37),\"\"))","v":"cm³"},{"$f":"T(IFERROR(INDEX(INDIRECT($F$28),4,T37),\"\"))","v":"cm"},"mm","","","","","",{"$f":"IFERROR(INDEX(INDIRECT($F$28),4,AA37),\"\")","v":""},{"$f":"IFERROR(INDEX(INDIRECT($F$28),4,AB37),\"\")","v":""},{"$f":"IFERROR(INDEX(INDIRECT($F$28),4,AC37),\"\")","v":""}]
[null,null,null,null,{"$f":"IFERROR(INDEX((INDIRECT($O$13)),جستجو!$E$30,F37),\"\")","v":140},{"$f":"IFERROR(INDEX((INDIRECT($O$13)),جستجو!$E$30,G37),\"\")","v":140},{"$f":"IFERROR(INDEX((INDIRECT($O$13)),جستجو!$E$30,H37),\"\")","v":15},{"$f":"IFERROR(INDEX((INDIRECT($O$13)),جستجو!$E$30,I37),\"\")","v":7.5},{"$f":"IFERROR(INDEX((INDIRECT($O$13)),جستجو!$E$30,J37),\"\")","v":4},{"$f":"IFERROR(INDEX((INDIRECT($O$13)),جستجو!$E$30,K37),\"\")","v":31},{"$f":"IFERROR(INDEX((INDIRECT($O$13)),جستجو!$E$30,L37),\"\")","v":109},{"$f":"IFERROR(INDEX((INDIRECT($O$13)),جستجو!$E$30,M37),\"\")","v":39.9},{"$f":"IFERROR(INDEX((INDIRECT($O$13)),جستجو!$E$30,N37),\"\")","v":31.2},{"$f":"IFERROR(INDEX((INDIRECT($O$13)),جستجو!$E$30,O37),\"\")","v":3.8},{"$f":"IFERROR(INDEX((INDIRECT($O$13)),جستجو!$E$30,P37),\"\")","v":660},{"$f":"IFERROR(INDEX((INDIRECT($O$13)),جستجو!$E$30,Q37),\"\")","v":64.7},{"$f":"IFERROR(INDEX((INDIRECT($O$13)),جستجو!$E$30,R37),\"\")","v":4.07},{"$f":"IFERROR(INDEX((INDIRECT($O$13)),جستجو!$E$30,S37),\"\")","v":330},{"$f":"IFERROR(INDEX((INDIRECT($O$13)),جستجو!$E$30,T37),\"\")","v":47.2},{"$f":"IFERROR(INDEX((INDIRECT($O$13)),جستجو!$E$30,U37),\"\")","v":2.88},{"$f":"IFERROR(INDEX((INDIRECT($O$13)),جستجو!$E$30,V37),\"\")","v":""},{"$f":"IFERROR(INDEX((INDIRECT($O$13)),جستجو!$E$30,W37),\"\")","v":""},{"$f":"IFERROR(INDEX((INDIRECT($O$13)),جستجو!$E$30,X37),\"\")","v":""},{"$f":"IFERROR(INDEX((INDIRECT($O$13)),جستجو!$E$30,Y37),\"\")","v":""},{"$f":"IFERROR(INDEX((INDIRECT($O$13)),جستجو!$E$30,Z37),\"\")","v":""},{"$f":"IFERROR(INDEX((INDIRECT($O$13)),جستجو!$E$30,AA37),\"\")","v":""},{"$f":"IFERROR(INDEX((INDIRECT($O$13)),جستجو!$E$30,AB37),\"\")","v":""},{"$f":"IFERROR(INDEX((INDIRECT($O$13)),جستجو!$E$30,AC37),\"\")","v":""},{"$f":"IFERROR(INDEX((INDIRECT($O$13)),جستجو!$E$30,AD37),\"\")","v":""}]
[]
[]
[null,null,null,null,null,null,null,null,null,null,null,null,null,null,null,null,"نبشي_بال_مساوي!"]
[null,"UNP","IPE","T","بال_مساوي","توليد_گرم","توليد.گرم","توليد_سرد_گرم","z_شكل",null,null,null,null,{"$f":"INDEX(all,D38,$E$28)","v":"T"},{"$f":"INDEX(all,E29,E28)","v":"T"},null,"ناوداني!",null,5,28,5,22,5,14,5,48,4,69,4,75,4,147,5,13]
[null,"UPA","IPE_o","-","بال_مساوي_غيراستاندارد","توليد_سرد","توليد.سرد","-","-",null,null,null,null,"-",null,null,"شكلI!",null,30,38,24,36,null,null,50,83,71,142,77,148]
[null,"UPE","IPE_v","-","بال_نامساوي","-","-","-","-",null,null,null,null,"-",null,null,"سپري!",null,40,53,38,42,null,null,5,50]
{"$rows_left_out":167}
{"sheet":"ناوداني","index":1,"n_rows":54,"n_cols":24,"rows_kept":54,"cut":false,"hidden":false,"merged":[[29,0,37,0],[39,0,52,0],[0,0,3,0],[4,0,27,0],[0,1,3,1],[1,21,2,21],[1,22,2,22],[1,23,2,23],[53,1,53,20],[38,1,38,20],[28,1,28,20],[0,2,1,8],[0,12,0,17],[1,11,2,11],[1,10,2,10],[1,18,2,18],[1,19,2,19],[1,20,2,20]]}
[null,"علامت   ختصاري","اندازه به ميليمتر",null,null,null,null,null,null,null,null,null,"براي محور خمش"]
[null,null,null,null,null,null,null,null,null,"A","A","G","y-y","y-y","y-y","z-z","z-z","z-z","ez","ym","sy","d₁","w₁","a₁"]
[null,null,"h","b","ts","tg","r2","c","h-2c","ديواره",null,null,"Iу","Wy","iy","Iz","Wz","iz"]
[null,null,"mm","mm","mm","mm","mm","mm","mm","cm²","cm²","kg/m","cm⁴","cm³","cm","cm⁴","cm³","cm","cm","cm","cm","mm","mm","mm"]
["ناوداني      U ","30x15",30,15,4,4.5,2,9,12,1.02,2.21,1.74,2.5299999999999998,1.69,1.07,0.38,0.39,0.42,0.52,0.74,"_"]
[null,30,30,33,5,7,3.5,14.5,1,1.1499999999999999,5.44,4.2699999999999996,6.39,4.26,1.08,5.33,2.68,0.99,1.31,2.2200000000000002,"_"]
[null,"40x20",40,20,5,5.5,2.5,11,18,1.72,3.66,2.87,7.58,3.79,1.44,1.1399999999999999,0.86,0.56000000000000005,0.67,1.01,"_"]
[null,40,40,35,5,7,3.5,14.5,11,1.65,6.21,4.87,14.1,7.05,1.5,6.68,3.08,1.04,1.33,2.3199999999999998,"_"]
[null,"50x25",50,25,5,6,3,12.5,25,2.2000000000000002,4.92,3.86,16.8,6.73,1.85,2.4900000000000002,1.48,0.71,0.81,1.34,"_"]
[null,50,50,38,5,7,3.5,15,20,2.15,7.12,5.59,26.4,10.6,1.92,9.1199999999999992,3.75,1.1299999999999999,1.37,2.4700000000000002,"_"]
[null,60,60,30,6,6,3,12.5,35,3.24,6.46,5.07,31.6,10.5,2.21,4.51,2.16,0.84,0.91,1.5,"_"]
[null,65,65,42,5.5,7.5,4,16,33,3.16,9.0299999999999994,7.09,57.5,17.7,2.52,14.1,5.07,1.25,1.42,2.6,"_"]
[null,80,80,45,6,8,4,16.5,47,4.32,11,8.64,106,26.5,3.1,19.399999999999999,6.36,1.33,1.45,2.67,6.65]
[null,100,100,50,6,8.5,4.5,18,64,5.49,13.5,10.6,206,41.2,3.91,29.3,8.49,1.47,1.55,2.93,8.42]
[null,120,120,55,7,9,4.5,19,82,7.77,17,13.4,364,60.7,4.62,43.2,11.1,1.59,1.6,3.03,10]
{"$rows_left_out":40}
{"sheet":"شكلI","index":2,"n_rows":189,"n_cols":22,"rows_kept":189,"cut":false,"hidden":false,"merged":[[142,0,166,0],[167,1,167,18],[168,0,187,0],[188,1,188,18],[42,1,42,18],[66,1,66,18],[91,1,91,18],[61,1,61,18],[141,1,141,18],[116,1,116,18],[67,0,90,0],[92,0,115,0],[117,0,140,0],[62,0,65,0],[0,12,0,17],[0,1,3,1],[0,2,1,8],[1,10,2,10],[1,18,2,18],[1,20,2,20],[1,21,2,21],[1,11,2,11],[36,1,36,18],[22,1,22,18],[37,0,41,0],[43,0,60,0],[1,19,2,19],[4,0,21,0],[23,0,35,0]]}
[null,"علامت اختصاري","اندازه به ميليمتر",null,null,null,null,null,null,null,null,null,"براي محور خمش"]
[null,null,null,null,null,null,null,null,null,"A","A","G","y-y","y-y","y-y","z-z","z-z","z-z","Sy","d₁","w₁","a₁"]
[null,null,"h","b","ts","tg","r","c","h-2c","ديواره",null,null,"Iу","Wy","iy","Iz","Wz","iz"]
[null,null,"mm","mm","mm","mm","mm","mm","mm","cm²","cm²","kg/m","cm⁴","cm³","cm","cm⁴","cm³","cm","cm","mm","mm","mm"]
["IPE",80,80,46,3.8,5.2,5,10.5,59,2.84,7.64,6,80.099999999999994,20,3.24,8.49,3.69,1.05,6.9]
[null,100,100,55,4.0999999999999996,5.7,7,13,74,3.87,10.3,8.1,171,34.200000000000003,4.07,15.9,5.79,1.24,8.6]
[null,120,120,64,4.4000000000000004,6.3,7,13.5,93,5,13.2,10.4,318,53,4.9000000000000004,27.7,8.65,1.45,10.5]
[null,140,140,73,4.7,6.9,7,14,112,6.26,16.399999999999999,12.9,541,77.3,5.74,44.9,12.3,1.65,12.3]
[null,160,160,82,5,7.4,9,16.5,127,7.63,20.100000000000001,15.8,869,109,6.58,68.3,16.7,1.84,14]
[null,180,180,91,5.3,8,9,17,146,9.1199999999999992,23.9,18.8,1320,146,7.42,101,22.2,2.0499999999999998,15.8]
[null,200,200,100,5.6,8.5,12,20.5,159,10.7,28.5,22.4,1940,194,8.26,142,28.5,2.2400000000000002,17.600000000000001]
[null,220,220,110,5.9,9.1999999999999993,12,21.5,177,12.4,33.4,26.2,2770,252,9.11,205,37.299999999999997,2.48,19.399999999999999]
[null,240,240,120,6.2,9.8000000000000007,15,25,190,14.3,39.1,30.7,3890,324,9.9700000000000006,284,47.3,2.69,21.2]
[null,270,270,135,6.6,10.199999999999999,15,25.5,219,17.100000000000001,45.9,36.1,5790,429,11.2,420,62.2,3.02,23.9]
[null,300,300,150,7.1,10.7,15,26,248,20.5,53.8,42.2,8360,557,12.5,604,80.5,3.35,26.6]
{"$rows_left_out":175}
{"sheet":"سپري","index":3,"n_rows":14,"n_cols":21,"rows_kept":14,"cut":false,"hidden":false,"merged":[[1,19,2,19],[1,20,2,20],[1,11,2,11],[4,0,13,0],[0,1,3,1],[0,2,1,8],[1,10,2,10],[0,12,0,17],[1,18,2,18]]}
[null,"علامت اختصاري","اندازه به ميليمتر",null,null,null,null,null,null,null,null,null,"براي محور خمش"]
[null,null,null,null,null,null,null,null,null,"A","G","ey","y-y","y-y","y-y","z-z","z-z","z-z","d₁","w₁","w₂"]
[null,null,"h","b","ts=tg=r1","r2","r3","C","h-c","ديواره",null,null,"Iу","Wy","iy","Iz","Wz","iz"]
[null,null,"mm","mm","mm","mm","mm","mm","mm","cm²","kg/m","cm","cm⁴","cm³","cm","cm⁴","cm³","cm","mm","mm","mm"]
["T",30,30,30,4,2,1,9,21,2.2599999999999998,1.77,0.85,1.72,0.8,0.87,0.87,0.57999999999999996,0.62]
[null,35,35,35,4.5,2.5,1,10,25,2.97,2.33,0.99,3.1,1.23,1.04,1.57,0.9,0.73]
[null,40,40,40,5,2.5,1,11,29,3.77,2.96,1.1200000000000001,5.28,1.84,1.18,2.58,1.29,0.83]
[null,50,50,50,6,3,1.5,13,37,5.66,4.4400000000000004,1.39,12.1,3.36,1.46,6.06,2.42,1.03]
[null,60,60,60,7,3.5,2,15,45,7.94,6.23,1.66,23.8,5.48,1.73,12.2,4.07,1.24]
[null,70,70,70,8,4,2,17,53,10.6,8.32,1.94,44.4,8.7899999999999991,2.0499999999999998,22.1,6.32,1.44]
[null,80,80,80,9,4.5,2,19,61,13.6,10.7,2.2200000000000002,73.7,12.8,2.33,37,9.25,1.65]
[null,100,100,100,11,5.5,3,23,77,20.9,16.399999999999999,2.74,179,24.6,2.92,88.3,17.7,2.0499999999999998]
[null,120,120,120,13,6.5,3,27,93,29.6,23.2,3.28,366,42,3.51,178,29.7,2.4500000000000002]
[null,140,140,140,15,7.5,4,31,109,39.9,31.2,3.8,660,64.7,4.07,330,47.2,2.88]

{"sheet":"نبشي_بال_نامساوي","index":4,"n_rows":93,"n_cols":24,"rows_kept":93,"cut":false,"hidden":false,"merged":[[4,0,49,0],[51,0,92,0],[0,19,0,23],[2,1,3,1],[50,1,50,23],[93,1,93,23],[2,8,3,8],[0,2,0,3],[0,9,0,16],[1,2,2,2],[1,3,2,3],[1,4,2,4],[1,5,2,5]]}
[null,null,"اندازه به ميليمتر",null,null,null,null,null,null,"براي محور خمش",null,null,null,null,null,null,null,null,null,"سوراخهاي لبه"]
[null,"a*b*s","r₁","r₂","A","G",null,null,"ζ-ζ","y-y","y-y","y-y","z-z","z-z","ƞ-ƞ","ƞ-ƞ","ƞ-ƞ","ζ-ζ","ζ-ζ"]
[null,"علامت اختصاري",null,null,null,null,"ey","ez","tan a","Iу","Wy","iy","Iz","Wz","iz","Iƞ","iƞ","Iζ","iζ","d₁","d₂","w₁","w₂","w₃"]
[null,null,"mm","mm","cm²","kg/m","cm","cm",null,"cm⁴","cm³","cm","cm⁴","cm³","cm","cm⁴","cm","cm⁴","cm","mm","mm","mm","mm","mm"]
["بال_نامساوي","30*20*3",4,2,1.43,1.1200000000000001,0.99,0.502,0.42699999999999999,1.25,0.621,0.93500000000000005,0.437,0.29199999999999998,0.55300000000000005,1.43,1,0.25600000000000001,0.42399999999999999,8.4,4.3,17,null,12]
[null,"30*20*4",4,2,1.86,1.46,1.03,0.54100000000000004,0.42099999999999999,1.59,0.80700000000000005,0.92500000000000004,0.55300000000000005,0.379,0.54600000000000004,1.81,0.98799999999999999,0.33,0.42099999999999999,8.4,4.3,17,null,12]
[null,"40*20*4",4,2,2.2599999999999998,1.77,1.47,0.48,0.252,3.59,1.42,1.26,0.6,0.39300000000000002,0.51400000000000001,3.8,1.3,0.39300000000000002,0.41699999999999998,11,4.3,22,null,12]
[null,"40*25*4",4,2,2.46,1.93,1.36,0.623,0.38,3.89,1.47,1.26,1.1599999999999999,0.61899999999999999,0.68700000000000006,4.3499999999999996,1.33,0.7,0.53400000000000003,11,6.4,22,null,15]
[null,"45*30*4",4.5,2.25,2.87,2.25,1.48,0.74,0.436,5.78,1.91,1.42,2.0499999999999998,0.91,0.85,6.65,1.52,1.18,0.64,13,8.4,25,null,17]
[null,"50*30*5",5,2.5,3.78,2.96,1.73,0.74099999999999999,0.35199999999999998,9.36,2.86,1.57,2.5099999999999998,1.1100000000000001,0.81599999999999995,10.3,1.65,1.54,0.63900000000000001,13,8.4,30,null,17]
[null,"60*30*5",5,2.5,4.28,3.36,2.17,0.68400000000000005,0.25700000000000001,15.6,4.07,1.91,2.63,1.1399999999999999,0.78400000000000003,16.5,1.97,1.71,0.63300000000000001,17,8.4,35,null,17]
[null,"60*40*5",6,3,4.79,3.76,1.96,0.97199999999999998,0.434,17.2,4.25,1.89,6.11,2.02,1.1299999999999999,19.7,2.0299999999999998,3.54,0.86,17,11,35,null,22]
[null,"60*40*6",6,3,5.68,4.46,2,1.01,0.43099999999999999,20.100000000000001,5.03,1.88,7.12,2.38,1.1200000000000001,23.1,2.02,4.16,0.85499999999999998,17,11,35,null,22]
[null,"65*50*5",6,3,5.54,4.3499999999999996,1.99,1.25,0.57699999999999996,23.2,5.14,2.0499999999999998,11.9,3.19,1.47,28.8,2.2799999999999998,6.32,1.07,21,13,35,null,30]
[null,"70*50*6",7,3.5,6.89,5.41,2.23,1.25,0.5,33.4,7.01,2.2000000000000002,14.2,3.78,1.43,39.700000000000003,2.4,7.92,1.07,21,13,40,null,30]
{"$rows_left_out":79}
{"sheet":"نبشي_بال_مساوي","index":5,"n_rows":83,"n_cols":20,"rows_kept":83,"cut":false,"hidden":false,"merged":[[4,0,47,0],[49,0,82,0],[0,2,0,3],[0,9,0,16],[0,6,1,8],[1,2,2,2],[1,3,2,3],[1,4,2,4],[1,19,2,19],[83,1,83,19],[48,1,48,19],[1,5,2,5],[2,1,3,1],[1,17,2,17],[1,18,2,18]]}
[null,null,"اندازه به ميليمتر",null,null,null,null,null,null,"براي محور خمش"]
[null,"a*s","r₁","r₂","A","G",null,null,null,"y-y=z-z","y-y=z-z","y-y=z-z","ƞ-ƞ","ƞ-ƞ","ζ-ζ","ζ-ζ","ζ-ζ","d₁","w₁","w₂"]
[null,"علامت اختصاري",null,null,null,null,"e","w","v₁","Iу=Iz","Wy=Wz","iy=iz","Iƞ","iƞ","Iζ","Wζ","iζ"]
[null,null,"mm","mm","cm²","kg/m","cm","cm","cm","cm⁴","cm³","cm","cm⁴","cm","cm⁴","cm³","cm","mm","mm","mm"]
["بال_مساوي","20*3",3.5,1.75,1.1200000000000001,0.88200000000000001,0.59799999999999998,1.41,0.84599999999999997,0.39200000000000002,0.27900000000000003,0.59,0.61799999999999999,0.74199999999999999,0.16500000000000001,0.19500000000000001,0.38300000000000001,4.3,12]
[null,"25*3",3.5,1.75,1.42,1.1200000000000001,0.72299999999999998,1.77,1.02,0.80300000000000005,0.45200000000000001,0.751,1.27,0.94499999999999995,0.33400000000000002,0.32600000000000001,0.48399999999999999,6.4,15]
[null,"25*4",3.5,1.75,1.85,1.45,0.76200000000000001,1.77,1.08,1.02,0.58599999999999997,0.74099999999999999,1.61,0.93100000000000005,0.43,0.33900000000000002,0.48199999999999998,6.4,15]
[null,"30*3",5,2.5,1.74,1.36,0.83499999999999996,2.12,1.18,1.4,0.64900000000000002,0.89900000000000002,2.2200000000000002,1.1299999999999999,0.58499999999999996,0.496,0.58099999999999996,8.4,17]
[null,"30*4",5,2.5,2.27,1.78,0.878,2.12,1.24,1.8,0.85,0.89200000000000002,2.85,1.1200000000000001,0.754,0.60699999999999998,0.57699999999999996,8.4,17]
[null,"35*4",5,2.5,2.67,2.09,1,2.4700000000000002,1.42,2.95,1.18,1.05,4.68,1.32,1.23,0.86499999999999999,0.67800000000000005,11,18]
[null,"40*4",6,3,3.08,2.42,1.1200000000000001,2.83,1.58,4.47,1.55,1.21,7.09,1.52,1.86,1.17,0.77700000000000002,11,22]
[null,"40*5",6,3,3.79,2.97,1.1599999999999999,2.83,1.64,5.43,1.91,1.2,8.6,1.51,2.2599999999999998,1.38,0.77300000000000002,11,22]
[null,"45*4.5",7,3.5,3.9,3.06,1.25,3.18,1.78,7.14,2.2000000000000002,1.35,11.4,1.71,2.94,1.65,0.87,13,25]
[null,"50*4",7,3.5,3.89,3.06,1.36,3.54,1.92,8.9700000000000006,2.46,1.52,14.2,1.91,3.73,1.94,0.97899999999999998,13,30]
[null,"50*5",7,3.5,4.8,3.77,1.4,3.54,1.99,11,3.05,1.51,17.399999999999999,1.9,4.55,2.29,0.97299999999999998,13,30]
{"$rows_left_out":69}
{"sheet":"قوطي_مربع","index":6,"n_rows":142,"n_cols":8,"rows_kept":142,"cut":false,"hidden":false,"merged":[[69,1,69,7],[142,1,142,7],[3,0,68,0],[70,0,141,0]]}
[]
[null,"B","T","A","M","I","W","i"]
[null,"mm","mm","cm²","kg/m","cm⁴","cm³","cm"]
["تــــولــيـــد_گــــــرم",40,3,4.34,3.41,9.7799999999999994,4.8899999999999997,1.5]
[null,40,4,5.59,4.3899999999999997,11.8,5.91,1.45]
[null,50,3,5.54,4.3499999999999996,20.2,8.08,1.91]
[null,50,4,7.19,5.64,25,9.99,1.86]
[null,60,3,6.74,5.29,36.200000000000003,12.1,2.3199999999999998]
[null,60,4,8.7899999999999991,6.9,45.4,15.1,2.27]
[null,60,5,10.7,8.42,53.3,17.8,2.23]
[null,70,3,7.94,6.24,59,16.899999999999999,2.73]
[null,70,4,10.4,8.15,74.7,21.3,2.68]
[null,70,5,12.7,9.99,88.5,25.3,2.64]
[null,80,4,12,9.41,114,28.6,3.09]
[null,80,5,14.7,11.6,137,34.200000000000003,3.05]
{"$rows_left_out":128}
{"sheet":"قوطي_مستطيل","index":7,"n_rows":148,"n_cols":11,"rows_kept":148,"cut":false,"hidden":false,"merged":[[75,1,75,10],[148,1,148,10],[3,0,74,0],[76,0,147,0]]}
[]
[null,"H*B","T","A","M","Iy","Wy","iy","Iz","Wz","iz"]
[null,"mm","mm","cm²","kg/m","cm⁴","cm³","cm","cm⁴","cm³","cm"]
["تــــــــــوليــــــــــــــــد.گــــــــــــــــــــــــــــــــرم","50*30",3,4.34,3.41,13.6,5.43,1.77,5.94,3.96,1.17]
[null,"50*31",4,5.59,4.3899999999999997,16.5,6.6,1.72,7.08,4.72,1.1299999999999999]
[null,"60*40",3,5.54,4.3499999999999996,26.5,8.82,2.1800000000000002,13.9,6.95,1.58]
[null,"60*41",4,7.19,5.64,32.799999999999997,10.9,2.14,17,8.52,1.54]
[null,"80*40",3,6.74,5.29,54.2,13.6,2.84,18,9,1.63]
[null,"80*41",4,8.7899999999999991,6.9,68.2,17.100000000000001,2.79,22.2,11.1,1.59]
[null,"80*42",5,10.7,8.4,80.3,20.100000000000001,2.74,25.7,12.9,1.55]
[null,"90*50",3,7.94,6.23,84.4,18.8,3.26,33.5,13.4,2.0499999999999998]
[null,"90*51",4,10.4,8.16,107,23.8,3.21,41.9,16.8,2.0099999999999998]
[null,"90*52",5,12.7,9.9700000000000006,127,28.3,3.16,49.2,19.7,1.97]
[null,"100*50",4,11.2,8.7899999999999991,140,27.9,3.53,46.2,18.5,2.0299999999999998]
[null,"100*51",5,13.7,10.75,167,33.299999999999997,3.48,54.3,21.7,1.99]
{"$rows_left_out":134}
{"sheet":"قوطي_دايره","index":8,"n_rows":147,"n_cols":19,"rows_kept":147,"cut":false,"hidden":false,"merged":[]}
[]
[null,"D","T","A","M","I","W","i"]
[null,"mm","mm","cm²","kg/m","cm⁴","cm³","cm"]
[null,33.700000000000003,2.6,null,null,null,null,null,{"$f":"ROUND(((PI()*POWER(B4/10,2))/2)-((PI()*POWER((B4-C4)/10,2))/2),2)","v":2.65},2.54,{"$f":"I4-J4","v":0.10999999999999988},{"$f":"ROUND((PI()/2)*(ROUND(POWER(B4,1.991),0)-ROUND(POWER(B4-C4,1.991),0))/100,2)","v":2.54},{"$f":"J4-L4","v":0},{"$f":"((PI()*POWER(B4/10,2))/2)-((PI()*POWER((B4-C4)/10,2))/2)","v":2.6464776513840391},null,null,{"$f":"PI()*POWER(AVERAGE(B4,B4-C4)/20,3)","v":13.356569131331312},{"$f":"(PI()/64)*(POWER(B4,4)-POWER(B4-C4,4))","v":17391.493290923467},{"$f":"R4*2/10000","v":3.4782986581846935}]
[null,33.700000000000003,3.2,null,null,null,null,null,{"$f":"ROUND(((PI()*POWER(B5/10,2))/2)-((PI()*POWER((B5-C5)/10,2))/2),2)","v":3.23},3.07,{"$f":"I5-J5","v":0.16000000000000014},{"$f":"ROUND((3/2)*(ROUND(POWER(B5,2),0)-ROUND(POWER(B5-C5,2),0))/100,2)","v":3.09},{"$f":"J5-L5","v":-2.0000000000000018E-2},{"$f":"((PI()*POWER(B5/10,2))/2)-((PI()*POWER((B5-C5)/10,2))/2)","v":3.227043973767433},null,null,{"$f":"PI()*POWER(AVERAGE(B5,B5-C5)/20,3)","v":12.988978050819153},{"$f":"(PI()/64)*(POWER(B5,4)-POWER(B5-C5,4))","v":20833.997584890931},4.1667995169781857]
[null,33.700000000000003,4,null,null,null,null,null,3.98,3.73,0.25,3.81,-8.0000000000000071E-2,{"$f":"((PI()*POWER(B6/10,2))/2)-((PI()*POWER((B6-C6)/10,2))/2)","v":3.983539484751855},null,null,{"$f":"PI()*POWER(AVERAGE(B6,B6-C6)/20,3)","v":12.509434352600923},{"$f":"(PI()/64)*(POWER(B6,4)-POWER(B6-C6,4))","v":25118.457192320653},5.0236914384641302]
[null,42.4,2.6,null,null,null,null,null,3.36,3.25,0.10999999999999988,3.21,4.0000000000000036E-2,{"$f":"((PI()*POWER(B7/10,2))/2)-((PI()*POWER((B7-C7)/10,2))/2)","v":3.3571059096260605},null,null,{"$f":"PI()*POWER(AVERAGE(B7,B7-C7)/20,3)","v":27.263734969227993},{"$f":"(PI()/64)*(POWER(B7,4)-POWER(B7-C7,4))","v":35478.314891166861},7.0956629782333724]
[null,42.4,3.2,null,null,null,null,null,{"$f":"ROUND(((PI()*POWER(B8/10,2))/2)-((PI()*POWER((B8-C8)/10,2))/2),2)","v":4.0999999999999996},3.94,0.1599999999999997,3.92,2.0000000000000018E-2,null,null,null,null,{"$f":"(PI()/64)*(POWER(B8,4)-POWER(B8-C8,4))","v":42739.332300049653},8.5478664600099314]
[null,42.4,4,null,null,null,null,null,5.08,4.83,0.25,4.8499999999999996,-1.9999999999999574E-2,null,null,null,null,null,0]
[null,48.3,2.6,null,null,null,null,null,3.84,3.73,0.10999999999999988,3.68,4.9999999999999822E-2]
[null,48.3,3.2,null,null,null,null,null,4.6900000000000004,4.53,0.16000000000000014,4.49,4.0000000000000036E-2]
[null,48.3,4,null,null,null,null,null,5.82,5.57,0.25,5.57,0]
[null,60.3,3.2,null,null,null,null,null,5.9,5.74,0.16000000000000014,5.64,0.10000000000000053]
[null,60.3,4,null,null,null,null,null,7.33,7.07,0.25999999999999979,6.99,8.0000000000000071E-2]
[null,60.3,5,null,null,null,null,null,9.08,8.69,0.39000000000000057,8.67,1.9999999999999574E-2]
{"$rows_left_out":133}
{"sheet":"zشكل","index":9,"n_rows":13,"n_cols":25,"rows_kept":13,"cut":false,"hidden":false,"merged":[[0,2,1,7],[0,11,0,22]]}
[null,null,null,null,null,null,null,null,null,null,null,"براي محور خمش"]
[null,null,null,null,null,null,null,null,null,null,null,"y-y","y-y","y-y","z-z","z-z","z-z","ƞ-ƞ","ƞ-ƞ","ƞ-ƞ","ζ-ζ","ζ-ζ","ζ-ζ"]
[null,null,"h","b","ts","tg","r2","c","A","G",null,"I","W","i","I","W","i","I","W","i","I","W","i","d1","w1"]
[null,null,"mm","mm","mm","mm","mm","mm","cm²","kg/m","tan a","cm⁴","cm³","cm","cm⁴","cm³","cm","cm⁴","cm³","cm","cm⁴","cm³","cm","mm","mm"]
[null,30,30,38,4,4.5,2.5,9,4.32,3.39,1.655,5.96,3.97,1.17,13.7,3.8,1.78,18.100000000000001,4.6900000000000004,2.04,1.54,1.1100000000000001,0.6,11,20]
[null,40,40,40,4.5,5,2.5,10,5.43,4.26,1.181,13.5,6.75,1.58,17.600000000000001,4.66,1.8,28,6.72,2.27,3.05,1.83,0.75,11,22]
[null,50,50,43,5,5.5,3,11,6.77,5.31,0.93899999999999995,26.3,10.5,1.97,23.8,5.88,1.88,44.9,9.76,2.57,5.23,2.76,0.88,11,25]
[null,60,60,45,5,6,3,12,7.91,6.21,0.77900000000000003,44.7,14.9,2.38,30.1,7.09,1.95,67.2,13.5,2.81,7.6,3.73,0.98,13,25]
[null,80,80,50,6,7,3.5,14,11.1,8.7100000000000009,0.58799999999999997,109,27.3,3.13,47.4,10.1,2.0699999999999998,142,24.4,3.58,14.7,6.44,1.1499999999999999,13,30]
[null,100,100,55,6.5,8,4,16,14.5,11.4,0.49199999999999999,222,44.4,3.91,72.5,14,2.2400000000000002,270,39.799999999999997,4.3099999999999996,24.6,9.26,1.3,17,30]
[null,120,120,60,7,9,4.5,18,18.2,14.3,0.433,402,67,4.7,106,18.8,2.42,470,60.6,5.08,37.700000000000003,12.5,1.44,17,35]
[null,140,140,65,8,10,5,20,22.9,18,0.38500000000000001,676,96.6,5.43,148,24.3,2.54,768,88,5.79,56.4,16.600000000000001,1.57,17,35]
[null,160,160,70,8.5,11,5.5,22,27.5,21.6,0.35699999999999998,1060,132,6.2,204,31,2.72,1180,121,6.57,79.5,21.4,1.7,17,35]