{"text_format":"1","workbook":"xlsx","n_sheets":10,"sheets":["جستجو","ناوداني","شكلI","سپري","نبشي_بال_نامساوي","نبشي_بال_مساوي","قوطي_مربع","قوطي_مستطيل","قوطي_دايره","zشكل"],"not_rendered":{"charts":0,"images":0,"macros":1,"external_links":0,"defined_names":38,"comments":0,"pivot_tables":0},"unopened":[],"bounds":{"document_bytes":16777216,"sheet_cells":100000,"rows_first":2000,"rows_last":500,"rows_between":2000,"halvings":0,"cell_chars":16384,"cell_head_chars":4096},"cells_cut":0,"cells_raw":0,"read":"whole","date_system":"1900"}

{"sheet":"جستجو","index":0,"n_rows":181,"n_cols":35,"rows_kept":181,"cut":false,"hidden":false,"merged":[[6,3,7,3],[6,2,7,2],[6,1,7,1],[3,4,3,28],[2,3,2,28]]}
[null,null,null,{"$f":"SUM(E1:AC1)","v":1},{"$f":"IF((ISNUMBER(E5))=TRUE,1,0)","v":0},{"$f":"IF((ISNUMBER(F5))=TRUE,1,0)","v":0},0,0,0,0,0,0,1,0,0,0,0,0,0,{"$f":"IF((ISNUMBER(T5))=TRUE,1,0)","v":0},0,0,0,0,0,0,0,0,0]
[null,null,null,{"$f":"SUM(E2:AC2)","v":9},{"$f":"IF((ISNUMBER(E5))=TRUE,E37,0)","v":0},{"$f":"IF((ISNUMBER(F5))=TRUE,F37,0)","v":0},0,0,0,0,0,0,9,0,0,0,0,0,0,0,0,0,0,0,0,0,0,0,0]
[null,null,"www.amin-r.blog.ir","راهنمای خانه های ابی رنگ : برای یافتن پروفیل مورد نظر بر اساس یکی از مشخصات(مثلا A) ابتدا نوع پروفیل و ردیف را مشخص کرده و عدد مورد نظر را بالای واحد ها در یک خانه آبی رنگ وارد کرده و دکمه GO را زده تا علامت اختصاری مشخص شود(اندازه کوچکتر از عدد وارده انتخاب میشود)"]
[null,null,null,null,{"$f":"IF(D1>1,\"فـقــــط یـکــــی از خـــانــه هــای آبــی رنگ پر شــود\",\"\")","v":""}]
[null,null,null,null,null,null,null,null,null,null,null,null,456]
[null,null,null,null,{"$f":"T(IFERROR(INDEX(INDIRECT($F$28),2,E37),\"\"))","v":""},{"$f":"T(IFERROR(INDEX(INDIRECT($F$28),2,F37),\"\"))","v":""},"","","","","","A","G","ey","y-y","y-y","y-y","z-z",{"$f":"T(IFERROR(INDEX(INDIRECT($F$28),2,S37),\"\"))","v":"z-z"},{"$f":"T(IFERROR(INDEX(INDIRECT($F$28),2,T37),\"\"))","v":"z-z"},"d₁","","","","","",""]
[null,"نوع پروفيل","رديف","علامت اختصاري",{"$f":"T(IFERROR(INDEX(INDIRECT($F$28),3,E37),\"\"))","v":"h"},{"$f":"T(IFERROR(INDEX(INDIRECT($F$28),3,F37),\"\"))","v":"b"},"ts=tg=r1","r2","r3","C","h-c","ديواره","","","Iу","Wy","iy","Iz",{"$f":"T(IFERROR(INDEX(INDIRECT($F$28),3,S37),\"\"))","v":"Wz"},{"$f":"T(IFERROR(INDEX(INDIRECT($F$28),3,T37),\"\"))","v":"iz"},"","","","","","","",{"$f":"IFERROR(INDEX(INDIRECT($F$28),3,AB36),\"\")","v":""},{"$f":"IFERROR(INDEX(INDIRECT($F$28),3,AC36),\"\")","v":""}]
[null,null,null,null,{"$f":"T(IFERROR(INDEX(INDIRECT($F$28),4,E37),\"\"))","v":"mm"},{"$f":"T(IFERROR(INDEX(INDIRECT($F$28),4,F37),\"\"))","v":"mm"},"mm","mm","mm","mm","mm","cm²","kg/m","cm","cm⁴","cm³","cm","cm⁴",{"$f":"T(IFERROR(INDEX(INDIRECT($F$28),4,S37),\"\"))","v":"cm³"},{"$f":"T(IFERROR(INDEX(INDIRECT($F$28),4,T37),\"\"))","v":"cm"},"mm","","","","","",{"$f":"IFERROR(INDEX(INDIRECT($F$28),4,AA37),\"\")","v":""},{"$f":"IFERROR(INDEX(INDIRECT($F$28),4,AB37),\"\")","v":""},{"$f":"IFERROR(INDEX(INDIRECT($F$28),4,AC37),\"\")","v":""}]
[null,null,null,null,{"$f":"IFERROR(INDEX((INDIRECT($O$13)),جستجو!$E$30,F37),\"\")","v":140},{"$f":"IFERROR(INDEX((INDIRECT($O$13)),جستجو!$E$30,G37),\"\")","v":140},{"$f":"IFERROR(INDEX((INDIRECT($O$13)),جستجو!$E$30,H37),\"\")","v":15},{"$f":"IFERROR(INDEX((INDIRECT($O$13)),جستجو!$E$30,I37),\"\")","v":7.5},{"$f":"IFERROR(INDEX((INDIRECT($O$13)),جستجو!$E$30,J37),\"\")","v":4},{"$f":"IFERROR(INDEX((INDIRECT($O$13)),جستجو!$E$30,K37),\"\")","v":31},{"$f":"IFERROR(INDEX((INDIRECT($O$13)),جستجو!$E$30,L37),\"\")","v":109},{"$f":"IFERROR(INDEX((INDIRECT($O$13)),جستجو!$E$30,M37),\"\")","v":39.9},{"$f":"IFERROR(INDEX((INDIRECT($O$13)),جستجو!$E$30,N37),\"\")","v":31.2},{"$f":"IFERROR(INDEX((INDIRECT($O$13)),جستجو!$E$30,O37),\"\")","v":3.8},{"$f":"IFERROR(INDEX((INDIRECT($O$13)),جستجو!$E$30,P37),\"\")","v":660},{"$f":"IFERROR(INDEX((INDIRECT($O$13)),جستجو!$E$30,Q37),\"\")","v":64.7},{"$f":"IFERROR(INDEX((INDIRECT($O$13)),جستجو!$E$30,R37),\"\")","v":4.07},{"$f":"IFERROR(INDEX((INDIRECT($O$13)),جستجو!$E$30,S37),\"\")","v":330},{"$f":"IFERROR(INDEX((INDIRECT($O$13)),جستجو!$E$30,T37),\"\")","v":47.2},{"$f":"IFERROR(INDEX((INDIRECT($O$13)),جستجو!$E$30,U37),\"\")","v":2.88},{"$f":"IFERROR(INDEX((INDIRECT($O$13)),جستجو!$E$30,V37),\"\")","v":""},{"$f":"IFERROR(INDEX((INDIRECT($O$13)),جستجو!$E$30,W37),\"\")","v":""},{"$f":"IFERROR(INDEX((INDIRECT($O$13)),جستجو!$E$30,X37),\"\")","v":""},{"$f":"IFERROR(INDEX((INDIRECT($O$13)),جستجو!$E$30,Y37),\"\")","v":""},{"$f":"IFERROR(INDEX((INDIRECT($O$13)),جستجو!$E$30,Z37),\"\")","v":""},{"$f":"IFERROR(INDEX((INDIRECT($O$13)),جستجو!$E$30,AA37),\"\")","v":""},{"$f":"IFERROR(INDEX((INDIRECT($O$13)),جستجو!$E$30,AB37),\"\")","v":""},{"$f":"IFERROR(INDEX((INDIRECT($O$13)),جستجو!$E$30,AC37),\"\")","v":""},{"$f":"IFERROR(INDEX((INDIRECT($O$13)),جستجو!$E$30,AD37),\"\")","v":""}]
[]
[]
[null,null,null,null,null,null,null,null,null,null,null,null,null,null,null,null,"نبشي_بال_مساوي!"]
[null,"UNP","IPE","T","بال_مساوي","توليد_گرم","توليد.گرم","توليد_سرد_گرم","z_شكل",null,null,null,null,{"$f":"INDEX(all,D38,$E$28)","v":"T"},{"$f":"INDEX(all,E29,E28)","v":"T"},null,"ناوداني!",null,5,28,5,22,5,14,5,48,4,69,4,75,4,147,5,13]
[null,"UPA","IPE_o","-","بال_مساوي_غيراستاندارد","توليد_سرد","توليد.سرد","-","-",null,null,null,null,"-",null,null,"شكلI!",null,30,38,24,36,null,null,50,83,71,142,77,148]
[null,"UPE","IPE_v","-","بال_نامساوي","-","-","-","-",null,null,null,null,"-",null,null,"سپري!",null,40,53,38,42,null,null,5,50]
[null,"-","IPE_a","-","بال_نامساوي_غيراستاندارد","-","-","-","-",null,null,null,null,"-",null,null,"نبشي_بال_نامساوي!",null,null,null,44,61,null,null,52,93]
[null,"-","IPE_750","-","-","-","-","-","-",null,null,null,null,"-",null,null,"قوطي_مربع!",null,null,null,63,66]
[null,"-","IPB_LL","-","-","-","-","-","-",null,null,null,null,"-",null,null,"قوطي_مستطيل!",null,null,null,68,91]
[null,"-","IPB_L","-","-","-","-","-","-",null,null,null,null,"-",null,null,"قوطي_دايره!",null,null,null,93,116]
[null,"-","IPB","-","-","-","-","-","-",null,null,null,null,"-",null,null,"zشكل!",null,null,null,118,141]
[null,"-","IPB_v","-","-","-","-","-","-",null,null,null,null,"-",null,null,":",null,null,null,143,167]
[null,"-","INP","-","-","-","-","-","-",null,null,null,null,"-",null,null,{"$f":"INDEX(E36:AF36,1,D2+2)","v":"K"},null,null,null,169,188]
[null,null,null,null,null,null,null,null,null,null,null,null,null,null,null,null,{"$f":"INDEX(Q13:Q20,E28,1)","v":"سپري!"}]
[null,null,null,null,null,null,null,null,null,null,null,null,null,null,null,null,{"$f":"IF(AND(E28=4,E29<=2),CONCATENATE(Q12,Q22,S26,Q21,Q22,T26),CONCATENATE(Q23,Q22,S26,Q21,Q22,T26))","v":"سپري!K5:K14"}]
[]
[null,null,null,null,null,null,null,null,null,null,null,null,null,null,null,1,{"$f":"MATCH(Q27,INDIRECT(Q24),P26)","v":10},null,{"$f":"INDEX(S13:AJ22,E29,E28*2-1)","v":5},{"$f":"INDEX(S13:AJ22,E29,E28*2)","v":14}]
[null,null,null,null,null,null,null,null,null,null,null,null,null,null,null,null,{"$f":"SUM(E5:AC5)","v":456}]
[null,"ناوداني",null,null,3,{"$f":"IF(F29=\"nb\",IF(OR(E29=3,E29=4)=TRUE,\"nb.1\",INDEX(G28:N28,1,E28)),INDEX(G28:N28,1,E28))","v":"s"},"n","i","s","nb","m","ms","g","z"]
[null,"I شكل",null,null,1,{"$f":"INDEX(G28:N28,1,E28)","v":"s"}]
[null,"سپري",null,null,10]
[null,"نبشي"]
[null,"قوطي مربع"]
[null,"قوطي مستطيل"]
[null,"قوطي گرد"]
[null,"شكل Z"]
[null,null,null,null,"A","B","C","D","E","F","G","H","I","J","K","L","M","N","O","P","Q","R","S","T","U","V","W","X","Y","Z","AA","AB"]
[null,null,null,null,1,2,3,4,5,6,7,8,9,10,11,12,13,14,15,16,17,18,19,20,21,22,23,24,25,26,27,28,29,30,31]
[null,{"$f":"IF(OR($E$28=5,$E$28=6,$E$28=7)=TRUE,IFERROR(INDEX(INDIRECT($O$13),D38,1)&\"*\"&INDEX(INDIRECT($O$13),D38,2),\"\"),IFERROR(INDEX(INDIRECT($O$13),D38,1),\"-\"))","v":30},null,1]
[null,35,null,2]
[null,40,null,3,null,{"$f":"IF($E$28=1,ناوداني!$A$54,IF(جستجو!$E$28=2,شكلI!A43,IF(جستجو!$E$28=3,\"\",\"\")))","v":""}]
[null,50,null,4,null,{"$f":"IF($E$28=1,\"\",IF(جستجو!$E$28=2,شكلI!A62,IF(جستجو!$E$28=3,\"\",\"\")))","v":""}]
[null,60,null,5,null,{"$f":"IF($E$28=1,\"\",IF(جستجو!$E$28=2,شكلI!A67,IF(جستجو!$E$28=3,\"\",\"\")))","v":""}]
[null,70,null,6,null,{"$f":"IF($E$28=1,\"\",IF(جستجو!$E$28=2,شكلI!A92,IF(جستجو!$E$28=3,\"\",\"\")))","v":""}]
[null,80,null,7]
[null,100,null,8]
[null,120,null,9]
[null,140,null,10]
[null,"-",null,11]
[null,"-",null,12]
[null,"-",null,13]
[null,"-",null,14]
[null,"-",null,15]
[null,"-",null,16]
[null,"-",null,17]
[null,"-",null,18]
[null,"-",null,19]
[null,"-",null,20]
[null,"-",null,21]
[null,"-",null,22]
[null,"-",null,23]
[null,"-",null,24]
[null,"-",null,25]
[null,"-",null,26]
[null,"-",null,27]
[null,"-",null,28]
[null,"-",null,29]
[null,"-",null,30]
[null,"-",null,31]
[null,"-",null,32]
[null,{"$f":"IF(OR($E$28=5,$E$28=6,$E$28=7)=TRUE,IFERROR(INDEX(INDIRECT($O$13),D70,1)&\"*\"&INDEX(INDIRECT($O$13),D70,2),\"\"),IFERROR(INDEX(INDIRECT($O$13),D70,1),\"-\"))","v":"-"},null,33]
[null,"-",null,34]
[null,"-",null,35]
[null,"-",null,36]
[null,"-",null,37]
[null,"-",null,38]
[null,"-",null,39]
[null,"-",null,40]
[null,"-",null,41]
[null,"-",null,42]
[null,"-",null,43]
[null,"-",null,44]
[null,"-",null,45]
[null,"-",null,46]
[null,"-",null,47]
[null,"-",null,48]
[null,"-",null,49]
[null,"-",null,50]
[null,"-",null,51]
[null,"-",null,52]
[null,"-",null,53]
[null,"-",null,54]
[null,"-",null,55]
[null,"-",null,56]
[null,"-",null,57]
[null,"-",null,58]
[null,"-",null,59]
[null,"-",null,60]
[null,"-",null,61]
[null,"-",null,62]
[null,"-",null,63]
[null,"-",null,64]
[null,{"$f":"IF(OR($E$28=5,$E$28=6,$E$28=7)=TRUE,IFERROR(INDEX(INDIRECT($O$13),D102,1)&\"*\"&INDEX(INDIRECT($O$13),D102,2),\"\"),IFERROR(INDEX(INDIRECT($O$13),D102,1),\"-\"))","v":"-"},null,65]
[null,"-",null,66]
[null,"-",null,67]
[null,"-",null,68]
[null,"-",null,69]
[null,"-",null,70]
[null,"-",null,71]
[null,"-",null,72]
[null,"-",null,73]
[null,"-",null,74]
[null,"-",null,75]
[null,"-",null,76]
[null,"-",null,77]
[null,"-",null,78]
[null,"-",null,79]
[null,"-",null,80]
[null,"-",null,81]
[null,"-",null,82]
[null,"-",null,83]
[null,"-",null,84]
[null,"-",null,85]
[null,"-",null,86]
[null,"-",null,87]
[null,"-",null,88]
[null,"-",null,89]
[null,"-",null,90]
[null,"-",null,91]
[null,"-",null,92]
[null,"-",null,93]
[null,"-",null,94]
[null,"-",null,95]
[null,"-",null,96]
[null,{"$f":"IF(OR($E$28=5,$E$28=6,$E$28=7)=TRUE,IFERROR(INDEX(INDIRECT($O$13),D134,1)&\"*\"&INDEX(INDIRECT($O$13),D134,2),\"\"),IFERROR(INDEX(INDIRECT($O$13),D134,1),\"-\"))","v":"-"},null,97]
[null,"-",null,98]
[null,"-",null,99]
[null,"-",null,100]
[null,"-",null,101]
[null,"-",null,102]
[null,"-",null,103]
[null,"-",null,104]
[null,"-",null,105]
[null,"-",null,106]
[null,"-",null,107]
[null,"-",null,108]
[null,"-",null,109]
[null,"-",null,110]
[null,"-",null,111]
[null,"-",null,112]
[null,"-",null,113]
[null,"-",null,114]
[null,"-",null,115]
[null,"-",null,116]
[null,"-",null,117]
[null,"-",null,118]
[null,"-",null,119]
[null,"-",null,120]
[null,"-",null,121]
[null,"-",null,122]
[null,"-",null,123]
[null,"-",null,124]
[null,"-",null,125]
[null,"-",null,126]
[null,"-",null,127]
[null,"-",null,128]
[null,{"$f":"IF(OR($E$28=5,$E$28=6,$E$28=7)=TRUE,IFERROR(INDEX(INDIRECT($O$13),D166,1)&\"*\"&INDEX(INDIRECT($O$13),D166,2),\"\"),IFERROR(INDEX(INDIRECT($O$13),D166,1),\"-\"))","v":"-"},null,129]
[null,"-",null,130]
[null,"-",null,131]
[null,"-",null,132]
[null,"-",null,133]
[null,"-",null,134]
[null,"-",null,135]
[null,"-",null,136]
[null,"-",null,137]
[null,"-",null,138]
[null,"-",null,139]
[null,"-",null,140]
[null,"-",null,141]
[null,"-",null,142]
[null,"-",null,143]
[null,"-",null,144]

{"sheet":"ناوداني","index":1,"n_rows":54,"n_cols":24,"rows_kept":54,"cut":false,"hidden":false,"merged":[[29,0,37,0],[39,0,52,0],[0,0,3,0],[4,0,27,0],[0,1,3,1],[1,21,2,21],[1,22,2,22],[1,23,2,23],[53,1,53,20],[38,1,38,20],[28,1,28,20],[0,2,1,8],[0,12,0,17],[1,11,2,11],[1,10,2,10],[1,18,2,18],[1,19,2,19],[1,20,2,20]]}
[null,"علامت   ختصاري","اندازه به ميليمتر",null,null,null,null,null,null,null,null,null,"براي محور خمش"]
[null,null,null,null,null,null,null,null,null,"A","A","G","y-y","y-y","y-y","z-z","z-z","z-z","ez","ym","sy","d₁","w₁","a₁"]
[null,null,"h","b","ts","tg","r2","c","h-2c","ديواره",null,null,"Iу","Wy","iy","Iz","Wz","iz"]
[null,null,"mm","mm","mm","mm","mm","mm","mm","cm²","cm²","kg/m","cm⁴","cm³","cm","cm⁴","cm³","cm","cm","cm","cm","mm","mm","mm"]
["ناوداني      U ","30x15",30,15,4,4.5,2,9,12,1.02,2.21,1.74,2.5299999999999998,1.69,1.07,0.38,0.39,0.42,0.52,0.74,"_"]
[null,30,30,33,5,7,3.5,14.5,1,1.1499999999999999,5.44,4.2699999999999996,6.39,4.26,1.08,5.33,2.68,0.99,1.31,2.2200000000000002,"_"]
[null,"40x20",40,20,5,5.5,2.5,11,18,1.72,3.66,2.87,7.58,3.79,1.44,1.1399999999999999,0.86,0.56000000000000005,0.67,1.01,"_"]
[null,40,40,35,5,7,3.5,14.5,11,1.65,6.21,4.87,14.1,7.05,1.5,6.68,3.08,1.04,1.33,2.3199999999999998,"_"]
[null,"50x25",50,25,5,6,3,12.5,25,2.2000000000000002,4.92,3.86,16.8,6.73,1.85,2.4900000000000002,1.48,0.71,0.81,1.34,"_"]
[null,50,50,38,5,7,3.5,15,20,2.15,7.12,5.59,26.4,10.6,1.92,9.1199999999999992,3.75,1.1299999999999999,1.37,2.4700000000000002,"_"]
[null,60,60,30,6,6,3,12.5,35,3.24,6.46,5.07,31.6,10.5,2.21,4.51,2.16,0.84,0.91,1.5,"_"]
[null,65,65,42,5.5,7.5,4,16,33,3.16,9.0299999999999994,7.09,57.5,17.7,2.52,14.1,5.07,1.25,1.42,2.6,"_"]
[null,80,80,45,6,8,4,16.5,47,4.32,11,8.64,106,26.5,3.1,19.399999999999999,6.36,1.33,1.45,2.67,6.65]
[null,100,100,50,6,8.5,4.5,18,64,5.49,13.5,10.6,206,41.2,3.91,29.3,8.49,1.47,1.55,2.93,8.42]
[null,120,120,55,7,9,4.5,19,82,7.77,17,13.4,364,60.7,4.62,43.2,11.1,1.59,1.6,3.03,10]
[null,140,140,60,7,10,5,21.5,97,9.1,20.399999999999999,16,605,86.4,5.45,62.7,14.8,1.75,1.75,3.37,11.8]
[null,160,160,65,7.5,10.5,5.5,22,116,11.2,24,18.8,925,116,6.21,85.3,18.3,1.89,1.84,3.56,13.3]
[null,180,180,70,8,11,5.5,23.5,133,13.5,28,22,1350,150,6.95,114,22.4,2.02,1.92,3.75,15.1]
[null,200,200,75,8.5,11.5,6,24.5,151,16,32.200000000000003,25.3,1910,191,7.7,148,27,2.14,2.0099999999999998,3.94,16.8]
[null,220,220,80,9,12.5,6.5,27,166,18.7,37.4,29.4,2690,245,8.48,197,33.6,2.2999999999999998,2.14,4.2,18.5]
[null,240,240,85,9.5,13,6.5,27.5,185,21.6,42.3,33.200000000000003,3600,300,9.2200000000000006,248,39.6,2.42,2.23,4.3899999999999997,20.100000000000001]
[null,260,260,90,10,14,7,29.5,201,24.6,48.3,37.9,4820,371,9.99,317,47.7,2.56,2.36,4.66,21.8]
[null,280,280,95,10,15,7.5,32,216,26.5,53.3,41.8,6280,448,10.9,399,57.2,2.74,2.5299999999999998,5.0199999999999996,23.6]
[null,300,300,100,10,16,8,34,232,28.4,58.8,46.2,8030,535,11.7,495,67.8,2.9,2.7,5.41,25.4]
[null,320,320,100,14,17.5,8.75,36.5,247,42.3,75.8,59.5,10870,679,12.1,597,80.599999999999994,2.81,2.6,4.82,26.3]
[null,350,350,100,14,16,8,33.5,283,46.8,77.3,60.6,12840,734,12.9,570,75,2.72,2.4,4.45,28.6]
[null,380,380,102,13.5,16,8,33.5,313,49.1,80.400000000000006,63.1,15760,829,14,615,78.7,2.77,2.38,4.58,31.1]
[null,400,400,110,14,18,9,37.5,325,53.5,91.5,71.8,20350,1020,14.9,846,102,3.04,2.65,5.1100000000000003,32.9]
["ناوداني U "]
["ناوداني U با لبه موازي",80,80,45,5,8,8,16,48,3.6,10.7,8.3800000000000008,107,26.8,3.17,21.3,7.38,1.41,1.61,3.17,6.72]
[null,100,100,50,5.5,8.5,8.5,17,66,5.03,13.4,10.5,210,41.9,3.96,32.799999999999997,9.9499999999999993,1.57,1.7,3.38,8.4499999999999993]
[null,130,130,55,6,9.5,9.5,19,92,7.23,17.5,13.7,460,70.7,5.12,51.3,13.8,1.71,1.77,3.56,11]
[null,150,150,65,7,10.25,10.25,20.5,109,9.7799999999999994,22.8,17.899999999999999,796,106,5.9,93.3,21,2.02,2.0499999999999998,4.0999999999999996,12.7]
[null,175,175,70,7.5,10.75,10.75,21.5,132,12.3,27.1,21.2,1270,145,6.85,126,25.9,2.16,2.12,4.32,14.8]
[null,200,200,75,8,11.5,11.5,23,154,15.1,32,25.1,1946,195,7.8,170,32.1,2.2999999999999998,2.2200000000000002,4.53,16.899999999999999]
[null,220,220,80,8,12.5,12.5,25,170,16.600000000000001,36.299999999999997,28.5,2710,246,8.64,222,39.700000000000003,2.48,2.4,4.9400000000000004,18.7]
[null,250,250,85,9,13.5,13.5,27,196,21.3,43.8,34.4,4137,331,9.7200000000000006,295,48.9,2.6,2.4500000000000002,5.04,21.1]
[null,300,300,100,9.5,16,16,32,236,27,58.6,46,8171,545,11.8,562,79.7,3.1,2.96,6.17,25.6]
["UPA","تير آهن U با لبه موازي از طرف داخل بر حسب معيار استاندارد فرانسه"]
["ناوداني U با لبه موازي",80,80,50,4,7,10,17,46,2.92,10.1,7.9,107,26.8,3.26,25.4,7.98,1.59,1.82,3.71,6.87]
[null,100,100,55,4.5,7.5,10,17.5,65,4.16,12.5,9.82,207,41.4,4.07,38.200000000000003,10.6,1.75,1.91,3.93,8.6199999999999992]
[null,120,120,60,5,8,12,20,80,5.6,15.4,12.1,364,60.6,4.8600000000000003,55.4,13.8,1.9,1.98,4.12,10.3]
[null,140,140,65,5,9,12,21,98,6.55,18.399999999999999,14.5,599,85.6,5.71,78.7,18.2,2.0699999999999998,2.17,4.54,12.1]
[null,160,160,70,5.5,9.5,12,21.5,117,8.2799999999999994,21.7,17,911,114,6.48,107,22.6,2.2200000000000002,2.27,4.76,13.8]
[null,180,180,75,5.5,10.5,12,22.5,135,9.32,25.1,19.7,1353,150,7.34,144,28.6,2.39,2.4700000000000002,5.19,15.6]
[null,200,200,80,6,11,13,24,152,11.3,29,22.8,1909,191,8.11,187,34.4,2.54,2.56,5.41,17.399999999999999]
[null,220,220,85,6.5,12,13,25,170,13.5,33.9,26.6,2682,244,8.9,246,42.5,2.7,2.7,5.7,19.100000000000001]
[null,240,240,90,7,12.5,15,27.5,185,15.9,38.5,30.2,3599,300,9.67,311,50.1,2.84,2.79,5.91,20.7]
[null,270,270,95,7.5,13.5,15,28.5,213,19.2,44.8,35.200000000000003,5255,389,10.8,401,60.7,2.99,2.89,6.14,23.3]
[null,300,300,100,9.5,15,15,30,240,27.1,56.6,44.4,7823,522,11.8,538,75.599999999999994,3.08,2.89,6.03,25.5]
[null,330,330,105,11,16,18,34,262,34.5,67.8,53.2,11008,667,12.7,681,89.7,3.17,2.9,6,27.8]
[null,360,360,110,12,17,18,35,290,41.2,77.900000000000006,61.2,14825,824,13.8,844,105,3.29,2.97,6.12,30.2]
[null,400,400,115,13.5,18,18,36,328,51.6,91.9,72.2,20981,1049,15.1,1045,123,3.37,2.98,6.06,33.200000000000003]
["UPE","تير آهن U با لبه موازي از طرف داخل  ارتفاع پروفيل همانند IPE ميباشد"]

{"sheet":"شكلI","index":2,"n_rows":189,"n_cols":22,"rows_kept":189,"cut":false,"hidden":false,"merged":[[142,0,166,0],[167,1,167,18],[168,0,187,0],[188,1,188,18],[42,1,42,18],[66,1,66,18],[91,1,91,18],[61,1,61,18],[141,1,141,18],[116,1,116,18],[67,0,90,0],[92,0,115,0],[117,0,140,0],[62,0,65,0],[0,12,0,17],[0,1,3,1],[0,2,1,8],[1,10,2,10],[1,18,2,18],[1,20,2,20],[1,21,2,21],[1,11,2,11],[36,1,36,18],[22,1,22,18],[37,0,41,0],[43,0,60,0],[1,19,2,19],[4,0,21,0],[23,0,35,0]]}
[null,"علامت اختصاري","اندازه به ميليمتر",null,null,null,null,null,null,null,null,null,"براي محور خمش"]
[null,null,null,null,null,null,null,null,null,"A","A","G","y-y","y-y","y-y","z-z","z-z","z-z","Sy","d₁","w₁","a₁"]
[null,null,"h","b","ts","tg","r","c","h-2c","ديواره",null,null,"Iу","Wy","iy","Iz","Wz","iz"]
[null,null,"mm","mm","mm","mm","mm","mm","mm","cm²","cm²","kg/m","cm⁴","cm³","cm","cm⁴","cm³","cm","cm","mm","mm","mm"]
["IPE",80,80,46,3.8,5.2,5,10.5,59,2.84,7.64,6,80.099999999999994,20,3.24,8.49,3.69,1.05,6.9]
[null,100,100,55,4.0999999999999996,5.7,7,13,74,3.87,10.3,8.1,171,34.200000000000003,4.07,15.9,5.79,1.24,8.6]
[null,120,120,64,4.4000000000000004,6.3,7,13.5,93,5,13.2,10.4,318,53,4.9000000000000004,27.7,8.65,1.45,10.5]
[null,140,140,73,4.7,6.9,7,14,112,6.26,16.399999999999999,12.9,541,77.3,5.74,44.9,12.3,1.65,12.3]
[null,160,160,82,5,7.4,9,16.5,127,7.63,20.100000000000001,15.8,869,109,6.58,68.3,16.7,1.84,14]
[null,180,180,91,5.3,8,9,17,146,9.1199999999999992,23.9,18.8,1320,146,7.42,101,22.2,2.0499999999999998,15.8]
[null,200,200,100,5.6,8.5,12,20.5,159,10.7,28.5,22.4,1940,194,8.26,142,28.5,2.2400000000000002,17.600000000000001]
[null,220,220,110,5.9,9.1999999999999993,12,21.5,177,12.4,33.4,26.2,2770,252,9.11,205,37.299999999999997,2.48,19.399999999999999]
[null,240,240,120,6.2,9.8000000000000007,15,25,190,14.3,39.1,30.7,3890,324,9.9700000000000006,284,47.3,2.69,21.2]
[null,270,270,135,6.6,10.199999999999999,15,25.5,219,17.100000000000001,45.9,36.1,5790,429,11.2,420,62.2,3.02,23.9]
[null,300,300,150,7.1,10.7,15,26,248,20.5,53.8,42.2,8360,557,12.5,604,80.5,3.35,26.6]
[null,330,330,160,7.5,11.5,18,29.5,271,23.9,62.6,49.1,11770,713,13.7,788,98.5,3.55,29.3]
[null,360,360,170,8,12.7,18,31,298,27.8,72.7,57.1,16270,904,15,1040,123,3.79,31.9]
[null,400,400,180,8.6,13.5,21,34.5,331,33.200000000000003,84,66.3,23130,1160,16.5,1320,146,3.95,35.4]
[null,450,450,190,9.4,14.6,21,36,378,40.9,98.8,77.599999999999994,33740,1500,18.5,1680,176,4.12,40.1]
[null,500,500,200,10.199999999999999,16,21,37,426,49.4,116,90.7,48200,1930,20.399999999999999,2140,214,4.3099999999999996,43.9]
[null,550,550,210,11.1,17.2,24,41.5,467,59.1,134,106,67120,2440,22.3,2670,254,4.45,48.2]
[null,600,600,220,12,19,24,43,514,69.7,156,122,92080,3070,24.3,3390,308,4.66,52.4]
["IPE","تير آهن باريك I با لبه موازي (گرم غلطك خورده) "]
["IPE o",180,182,92,6,9,9,18,146,10.3,27.1,21.3,1510,165,7.45,117,25.5,2.08,15.9]
[null,200,202,102,6.2,9.5,12,21.5,159,11.9,32,25.1,2210,219,8.32,169,33.1,2.2999999999999998,17.7]
[null,220,222,112,6.6,10.199999999999999,12,22.5,177,14,37.4,29.4,3130,282,9.16,240,42.8,2.5299999999999998,19.5]
[null,240,242,122,7,10.8,15,26,190,16.2,43.7,34.299999999999997,4370,361,10,329,53.9,2.74,21.3]
[null,270,274,136,7.5,12.2,15,27.5,219,19.600000000000001,53.8,42.3,6950,507,11.4,514,75.5,3.09,24.2]
[null,300,304,152,8,12.7,15,28,248,23.3,62.8,49.3,9990,658,12.6,746,98.1,3.45,26.9]
[null,330,334,162,8.5,13.5,18,31.5,271,27.2,72.599999999999994,57,13910,833,13.8,960,119,3.64,29.5]
[null,360,364,172,9.1999999999999993,14.7,18,33,298,32.1,84.1,66,19050,1050,15.1,1250,146,3.86,32.1]
[null,400,404,182,9.6999999999999993,15.5,21,36.5,331,37.6,96.4,75.7,26750,1320,16.7,1560,172,4.03,35.6]
[null,450,456,192,11,17.600000000000001,21,39,378,48.2,118,92.4,40920,1790,18.7,2090,217,4.21,40]
[null,500,506,202,12,19,21,40,426,58.4,137,107,57780,2280,20.6,2620,260,4.38,44.2]
[null,550,556,212,12.7,20.2,24,44.5,467,68,156,123,79160,2850,22.5,3220,304,4.55,48.5]
[null,600,610,224,15,24,24,48,514,87.9,197,154,118300,3880,24.5,4520,404,4.79,52.9]
["IPE o"]
["IPE v",400,408,182,10.6,17.5,21,38.5,331,41.4,107,84,30140,1480,16.8,1770,194,4.0599999999999996,35.799999999999997]
[null,450,460,194,12.4,19.600000000000001,21,41,378,54.6,132,104,46200,2010,18.7,2400,247,4.26,39.799999999999997]
[null,500,514,204,14.2,23,21,44,426,69.7,164,129,70720,2750,20.8,3270,321,4.46,44.7]
[null,550,566,216,17.100000000000001,25.2,24,49.5,467,92.4,202,159,102300,3620,22.5,4260,395,4.59,48.7]
[null,600,618,228,18,28,24,52,514,106,234,184,141600,4580,24.6,5570,489,4.88,53.2]
["IPE v"]
["IPEa ,IPEi",80,78,46,3.3,4.2,5,9.1999999999999993,59.6,2.44,6.38,5,64.400000000000006,16.5,3.18,6.85,2.98,1.04,6.79]
[null,100,98,55,3.6,4.7,7,11.700000000000003,74.599999999999994,3.35,8.7799999999999994,6.89,141,28.8,4.01,13.1,4.7699999999999996,1.22,8.56]
[null,120,117.6,64,3.8,5.0999999999999996,7,12.099999999999994,93.4,4.2699999999999996,11,8.66,257,43.8,4.83,22.4,7,1.43,10.3]
[null,140,137.4,73,3.8,5.6,7,12.700000000000003,112,5.01,13.4,10.5,435,63.3,5.7,36.4,9.98,1.65,12.2]
[null,160,157,82,4,5.9,7,15,127,6.04,16.2,12.7,689,87.8,6.53,54.4,13.3,1.83,13.9]
[null,180,177,91,4.3,6.5,9,15.5,146,7.33,19.600000000000001,15.4,1063,120,7.37,81.900000000000006,18,2.0499999999999998,15.7]
[null,200,197,100,4.5,7,12,19,159,8.5500000000000007,23.5,18.399999999999999,1592,162,8.23,117,23.4,2.23,17.5]
[null,220,217,110,5,7.7,12,19.5,178,10.5,28.3,22.2,2317,214,9.0500000000000007,171,31.2,2.46,19.3]
[null,240,237,120,5.2,8.3000000000000007,15,23.5,190,11.9,33.299999999999997,26.2,3291,278,9.94,240,40,2.69,21.1]
[null,270,267,135,5.5,8.6999999999999993,15,23.5,220,14.2,39.1,30.7,4917,368,11.2,358,53,3.02,23.8]
[null,300,297,150,6.1,9.1999999999999993,15,24,249,17.600000000000001,46.5,36.5,7174,483,12.4,519,69.2,3.34,26.5]
[null,330,327,160,6.5,10,18,28,271,20.6,54.7,43,10230,626,13.7,685,85.6,3.54,29.2]
[null,360,357.6,170,6.6,11.5,18,29.300000000000011,299,22.8,64,50.2,14520,812,15.1,944,111,3.84,32]
[null,400,397,180,7,12,21,33,331,26.9,73.099999999999994,57.4,20290,1022,16.7,1171,130,4,35.5]
[null,450,447,190,7.6,13.1,21,34,379,33,85.6,67.2,29760,1331,18.7,1502,158,4.1900000000000004,39.799999999999997]
[null,500,497,200,8.4,14.5,21,35.5,426,40.5,101,79.400000000000006,42930,1728,20.6,1939,194,4.38,44.1]
[null,550,547,210,9,15.7,24,39.5,468,47.8,117,92.1,59980,2193,22.6,2432,232,4.55,48.5]
[null,600,597,220,9.8000000000000007,17.5,24,41.5,514,56.8,137,108,82920,2778,24.6,3116,283,4.7699999999999996,52.8]
["IPEa"]
["IPE 750",137,753,263,11.5,17,17,34,685,84.6,175,137,159900,4246,30.3,5166,393,5.44,65.7]
[null,147,753,265,13.2,17,17,34,685,97.2,187,147,166100,4411,29.8,5289,399,5.31,65]
[null,173,762,267,14.4,21.6,17,38.5,685,107,221,173,205800,5402,30.5,6873,515,5.57,66.2]
[null,196,770,268,15.6,25.4,17,42.5,685,116,251,196,240300,6241,31,8175,610,5.71,67]
["IPE 750","تير آهن باريك I رديف IPE 750 (استاندارد نشده) حداقل ميزان ذكر شده ضروري مي باشد."]
["IPB LL",100,91,100,4.2,5.5,12,17.5,56,3.6,15.6,12.2,237,52,3.89,92.1,18.399999999999999,2.4300000000000002,8.11]
[null,120,109,120,4.2,5.5,12,17.5,74,4.3499999999999996,18.600000000000001,14.6,413,75.8,4.72,159,26.5,2.93,9.83]
[null,140,128,140,4.3,6,12,18,92,5.25,23,18.100000000000001,719,112,5.59,275,39.299999999999997,3.45,11.6]
[null,160,148,160,4.5,7,15,22,104,6.34,30.4,23.8,1283,173,6.5,479,59.8,3.97,13.5]
[null,180,167,180,5,7.5,15,22.5,122,7.97,36.5,28.7,1967,263,7.34,730,81.099999999999994,4.47,15.2]
[null,200,186,200,5.5,8,18,26,134,9.7899999999999991,44.1,34.6,2944,317,8.17,1068,107,4.92,17]
[null,220,205,220,6,8.5,18,26.5,152,11.8,51.5,40.4,4170,407,9,1510,137,5.42,18.7]
[null,240,224,240,6.5,9,21,30,164,14,60.4,47.4,5835,521,9.83,2077,173,5.87,20.5]
[null,260,244,260,6.5,9.5,24,33.5,177,15.2,69,54.1,7981,654,10.8,2788,214,6.38,22.3]
[null,280,264,280,7,10,24,34,196,17.8,78,61.2,10560,800,11.6,3664,262,6.85,24.2]
[null,300,283,300,7.5,10.5,27,37.5,208,20.399999999999999,88.9,69.8,13800,976,12.5,4734,316,7.3,25.9]
[null,320,301,300,8,11,27,38,225,23.2,94.6,74.2,16450,1093,13.2,4959,331,7.24,27.5]
[null,340,320,300,8.5,11.5,27,38.5,243,26.2,101,78.900000000000006,19550,1222,13.9,5185,346,7.18,29.1]
[null,360,339,300,9,12,27,39,261,29.4,107,83.7,23040,1359,14.7,5410,361,7.12,30.8]
[null,400,378,300,9.5,13,27,40,298,34.700000000000003,118,92.4,31250,1654,16.3,5861,391,7.06,34.299999999999997]
[null,450,425,300,10,13.5,27,40.5,344,41.1,127,99.7,41890,1971,18.2,6088,406,6.92,38.4]
[null,500,472,300,10.5,14,27,41,390,48.1,137,107,54640,2315,20,6314,421,6.79,42.4]
[null,550,522,300,11.5,15,27,42,438,58.3,153,120,72870,2792,21.8,6767,251,6.65,46.6]
[null,600,571,300,12,15.6,27,42.5,486,66.7,164,129,91870,3218,23.7,6993,466,6.53,50.7]
[null,650,620,300,12.5,16,27,43,534,75.5,176,138,113900,3676,25.5,7221,481,6.41,54.8]
[null,700,670,300,13,17,27,44,582,84.9,191,150,142700,4260,27.3,7673,512,6.34,59]
[null,800,770,300,14,18,30,48,674,105,218,172,208900,5426,30.9,8134,542,6.1,67.099999999999994]
[null,900,870,300,15,20,30,50,770,127,252,198,301100,6923,34.6,9041,603,5.99,75.3]
[null,1000,970,300,16,21,30,51,868,152,282,222,406500,8380,38,9501,633,5.8,83.2]
["IPB LL","تير آهن عريض I به ويژه نوع سبك HE-AA=IPBLL (استاندارد نشده)"]
["IPB L",100,96,100,5,8,12,20,56,4.4000000000000004,21.2,16.7,349,72.8,4.0599999999999996,134,26.8,2.5099999999999998,8.41]
[null,120,114,120,5,8,12,20,74,5.3,25.3,19.899999999999999,606,106,4.8899999999999997,231,38.5,3.02,10.1]
[null,140,133,140,5.5,8.5,12,20.5,92,6.85,31.4,24.7,1030,155,5.73,389,55.6,3.52,11.9]
[null,160,152,160,6,9,15,24,104,8.58,38.799999999999997,30.4,1670,220,6.57,616,76.900000000000006,3.98,13.6]
[null,180,171,180,6,9.5,15,24.5,122,9.69,45.3,35.5,2510,294,7.45,925,103,4.5199999999999996,15.5]
[null,200,190,200,6.5,10,18,28,134,11.7,53.8,42.3,3690,389,8.2799999999999994,1340,134,4.9800000000000004,17.2]
[null,220,210,220,7,11,18,29,152,13.9,64.3,50.5,5410,515,9.17,1950,178,5.51,19]
[null,240,230,240,7.5,12,21,33,164,16.3,76.8,60.3,7760,675,10.1,2770,231,6,20.9]
[null,260,250,260,7.5,12.5,24,36.5,177,17.8,86.8,68.2,10450,836,11,3670,282,6.5,22.7]
[null,280,270,280,8,13,24,37,196,20.6,97.3,76.400000000000006,13670,1010,11.9,4760,340,7,24.6]
[null,300,290,300,8.5,14,27,41,208,23.5,113,88.3,18260,1260,12.7,6310,421,7.49,26.4]
[null,320,310,300,9,15.5,27,42.5,225,26.5,124,97.6,22930,1480,13.6,6990,466,7.49,28.2]
[null,340,330,300,9.5,16.5,27,43.5,243,29.8,133,105,27690,1680,14.4,7440,496,7.46,29.9]
[null,360,350,300,10,17.5,27,44.5,261,33.200000000000003,143,112,33090,1890,15.2,7890,526,7.43,31.7]
[null,400,390,300,11,19,27,46,298,40.799999999999997,159,125,45070,2310,16.8,8560,571,7.34,35.200000000000003]
[null,450,440,300,11.5,21,27,48,344,48.2,178,140,63720,2900,18.899999999999999,9470,631,7.29,39.6]
[null,500,490,300,12,23,27,50,390,56,198,155,68970,3550,21,10370,691,7.24,44.1]
[null,550,540,300,12.5,24,27,51,438,64.3,212,166,111900,4150,23,10820,721,7.15,48.4]
[null,600,590,300,13,25,27,52,486,73.400000000000006,226,178,141200,4790,25,11270,751,7.05,52.8]
[null,650,640,300,13.5,26,27,53,534,82.9,242,190,175200,5470,26.9,11720,782,6.97,57.1]
[null,700,690,300,14.5,27,27,54,582,96.1,260,204,215300,6240,28.8,12180,812,6.84,61.2]
[null,800,790,300,15,28,30,58,674,114,286,224,303400,7680,32.6,12640,843,6.65,69.8]
[null,900,890,300,16,30,30,60,770,138,321,252,422100,9480,36.299999999999997,13550,903,6.5,78.099999999999994]
[null,1000,990,300,16.5,31,30,61,868,158,347,272,553800,11190,40,14000,934,6.35,86.4]
["IPB L","تير آهن عريض I با لبه موازي نوع سبك"]
["IPB",100,100,100,6,10,12,22,56,5.4,26,20.399999999999999,450,89.9,4.16,167,33.5,2.5299999999999998,8.6300000000000008]
[null,120,120,120,6.5,11,12,23,74,7.08,34,26.7,864,144,5.04,318,52.9,3.06,10.5]
[null,140,140,140,7,12,12,24,92,8.9600000000000009,43,33.700000000000003,1510,216,5.93,550,78.5,3.58,12.3]
[null,160,160,160,8,13,15,28,104,11.8,54.3,42.6,2490,311,6.78,889,111,4.05,14.1]
[null,180,180,180,8.5,14,15,29,122,14.1,65.3,51.2,3830,426,7.66,1360,151,4.57,15.9]
[null,200,200,200,9,15,18,33,134,16.600000000000001,78.099999999999994,61.3,5700,570,8.5399999999999991,2000,200,5.07,17.7]
[null,220,220,220,9.5,16,18,34,152,19.399999999999999,91,71.5,8090,736,9.43,2840,258,5.59,19.600000000000001]
[null,240,240,240,10,17,21,38,164,22.3,106,83.2,11260,938,10.3,3920,327,6.08,21.4]
[null,260,260,260,10,17.5,24,41.5,177,24.2,118,93,14920,1150,11.2,5130,395,6.58,23.3]
[null,280,280,280,10.5,18,24,42,196,27.5,131,103,19270,1380,12.1,6590,471,7.09,25.1]
[null,300,300,300,11,19,27,46,208,30.9,149,117,25170,1680,13,8560,571,7.58,26.9]
[null,320,320,300,11.5,20.5,27,47.5,225,34.4,161,127,30820,1930,13.8,9240,616,7.57,28.7]
[null,340,340,300,12,21.5,27,48.5,243,38.200000000000003,171,134,36660,2160,14.6,9690,646,7.53,30.4]
[null,360,360,300,12.5,22.5,27,49.5,261,42.2,181,142,43190,2400,15.5,10140,676,7.49,32.200000000000003]
[null,400,400,300,13.5,24,27,51,298,50.8,198,155,57680,2880,17.100000000000001,10820,721,7.4,35.700000000000003]
[null,450,450,300,14,26,27,53,344,59.4,218,171,79890,3550,19.100000000000001,11720,781,7.33,40.1]
[null,500,500,300,14.5,28,27,55,390,68.400000000000006,239,187,107200,4290,21.2,12620,842,7.27,44.5]
[null,550,550,300,15,29,27,56,438,78.099999999999994,254,199,136700,4970,23.2,13080,872,7.17,48.9]
[null,600,600,300,15.5,30,27,57,486,88.3,270,212,171000,5700,25.2,13530,902,7.08,53.2]
[null,650,650,300,16,31,27,58,534,99,286,225,210600,6480,27.1,13980,932,6.99,57.5]
[null,700,700,300,17,32,27,59,582,114,306,241,256900,7340,29,14400,963,6.87,61.7]
[null,800,800,300,17.5,33,30,63,674,134,334,262,359100,8980,32.799999999999997,14900,994,6.68,70.2]
[null,900,900,300,18.5,35,30,65,770,160,371,291,494100,10980,36.5,15820,1050,6.53,78.5]
[null,1000,1000,300,19,36,30,66,868,183,400,314,644700,12890,40.1,16280,1090,6.38,86.8]
["IPB"]
["IPB v",100,120,106,12,20,12,32,56,12,53.2,41.8,1140,190,4.63,399,75.3,2.74,9.69]
[null,120,140,126,12.5,21,12,33,74,14.9,66.400000000000006,52.1,2020,288,5.51,703,112,3.25,11.5]
[null,140,160,146,13,22,12,34,92,17.899999999999999,80.599999999999994,63.2,3290,411,6.39,1140,157,3.77,13.3]
[null,160,180,166,14,23,15,38,104,22,97.1,76.2,5100,566,7.25,1760,212,4.26,15.1]
[null,180,200,186,14.5,24,15,39,122,25.5,113,88.9,7480,748,8.1300000000000008,2580,277,4.7699999999999996,16.899999999999999]
[null,200,220,206,15,25,18,43,134,29.2,131,103,10640,967,9,3650,354,5.27,18.7]
[null,220,240,226,15.5,26,18,44,152,33.200000000000003,149,117,14600,1220,9.89,5010,444,5.79,20.6]
[null,240,270,248,18,32,21,53,164,42.8,200,157,24290,1800,11,8150,657,6.39,22.9]
[null,260,290,268,18,32.5,24,56.5,177,46.3,220,172,31310,2160,11.9,10450,780,6.9,24.8]
[null,280,310,288,18.5,33,24,57,196,51.2,240,189,39550,2550,12.8,13160,914,7.4,26.7]
[null,300,340,310,21,39,27,66,208,63.2,303,238,59200,3480,14,19400,1250,8,29]
[null,305,320,305,16,29,27,56,208,46.6,225,177,40950,2560,13.5,13740,901,7.81,28]
[null,320,359,309,21,40,27,67,225,67,312,245,68130,3800,14.8,19710,1280,7.95,30.7]
[null,340,377,309,21,40,27,67,243,70.8,316,248,76370,4050,15.6,19710,1280,7.9,32.4]
[null,360,395,308,21,40,27,67,261,74.599999999999994,319,250,84870,4300,16.3,19520,1270,7.83,34]
[null,400,432,307,21,40,27,67,298,82.3,326,256,104100,4820,17.899999999999999,19340,1260,7.7,37.4]
[null,450,478,307,21,40,27,67,344,92,335,263,131500,5500,19.8,19340,1260,7.59,41.5]
[null,500,524,306,21,40,27,67,390,102,344,270,161900,6180,21.7,19150,1250,7.46,45.7]
[null,550,572,306,21,40,27,67,438,112,354,278,198000,6920,23.6,19160,1250,7.35,49.9]
[null,600,620,305,21,40,27,67,486,122,364,285,237400,7660,25.6,18980,1240,7.22,54.1]
[null,650,668,305,21,40,27,67,534,132,374,293,281700,8430,27.5,18980,1240,7.13,58.3]
[null,700,716,304,21,40,27,67,582,142,383,301,329300,9200,29.3,18800,1240,7.01,62.5]
[null,800,814,303,21,40,30,70,674,163,404,317,442600,10870,33.1,18630,1230,6.79,70.900000000000006]
[null,900,910,302,21,40,30,70,770,183,424,333,570400,12540,36.700000000000003,18450,1220,6.6,79]
[null,1000,1008,302,21,40,30,70,868,203,444,349,722300,14330,40.299999999999997,18460,1220,6.45,87.2]
["IPB v","تير آهن عريض I با لبه موازي نوع سنگين"]
["INP",80,80,42,3.9,5.9,2.2999999999999998,10.5,59,2.89,7.57,5.94,77.8,19.5,3.2,6.29,3,0.91,6.84]
[null,100,100,50,4.5,6.8,2.7,12.5,75,4.1900000000000004,10.6,8.34,171,34.200000000000003,4.01,12.2,4.88,1.07,8.57]
[null,120,120,58,5.0999999999999996,7.7,3.1,14,92,5.72,14.2,11.1,328,54.7,4.8099999999999996,21.5,7.41,1.23,10.3]
[null,140,140,66,5.7,8.6,3.4,15.5,109,7.49,18.2,14.3,573,81.900000000000006,5.61,35.200000000000003,10.7,1.4,12]
[null,160,160,74,6.3,9.5,3.8,17.5,125,9.48,22.8,17.899999999999999,935,117,6.4,54.7,14.8,1.55,13.7]
[null,180,180,82,6.9,10.4,4.0999999999999996,19,142,11.7,27.9,21.9,1450,161,7.2,81.3,19.8,1.71,15.5]
[null,200,200,90,7.5,11.3,4.5,20.5,159,14.2,33.4,26.2,2140,214,8,117,26,1.87,17.2]
[null,220,220,98,8.1,12.2,4.9000000000000004,22,176,16.8,39.5,31.1,3060,278,8.8000000000000007,162,33.1,2.02,18.899999999999999]
[null,240,240,106,8.6999999999999993,13.1,5.2,24,192,19.7,46.1,36.200000000000003,4250,354,9.59,221,41.7,2.2000000000000002,20.6]
[null,260,260,113,9.4,14.1,5.6,26,208,23.1,53.3,41.9,5740,442,10.4,288,51,2.3199999999999998,22.3]
[null,280,280,119,10.1,15.2,6.1,27.5,225,26.7,61,47.9,7590,542,11.1,364,61.2,2.4500000000000002,24]
[null,300,300,125,10.8,16.2,6.5,29.5,241,30.7,69,54.2,9800,653,11.9,451,72.2,2.56,25.7]
[null,320,320,131,11.5,17.3,6.9,31,258,34.799999999999997,77.7,61,12510,782,12.7,555,84.7,2.67,27.4]
[null,340,340,137,12.2,18.3,7.3,33,274,39.200000000000003,86.7,68,15700,923,13.5,674,98.4,2.8,29.1]
[null,360,360,143,13,19.5,7.8,35,290,44.3,97,76.099999999999994,19610,1090,14.2,818,114,2.9,30.7]
[null,380,380,149,13.7,20.5,8.1999999999999993,37,306,49.3,107,84,24010,1260,15,975,131,3.02,32.4]
[null,400,400,155,14.4,21.6,8.6,38.5,323,54.5,118,92.4,29210,1460,15.7,1160,149,3.13,34.1]
[null,450,450,170,16.2,24.3,9.6999999999999993,43.5,363,69,147,115,45850,2040,17.7,1730,203,3.43,38.4]
[null,500,500,185,18,27,10.8,48,404,85.1,179,141,68740,2750,19.600000000000001,2480,268,3.72,42.4]
[null,550,550,200,19,30,11.9,52.5,445,98.8,212,166,99180,3610,21.6,3490,349,4.0199999999999996,46.8]
["INP","تير آهن باريك I با لبه شيبدار از طرف داخل"]

{"sheet":"سپري","index":3,"n_rows":14,"n_cols":21,"rows_kept":14,"cut":false,"hidden":false,"merged":[[1,19,2,19],[1,20,2,20],[1,11,2,11],[4,0,13,0],[0,1,3,1],[0,2,1,8],[1,10,2,10],[0,12,0,17],[1,18,2,18]]}
[null,"علامت اختصاري","اندازه به ميليمتر",null,null,null,null,null,null,null,null,null,"براي محور خمش"]
[null,null,null,null,null,null,null,null,null,"A","G","ey","y-y","y-y","y-y","z-z","z-z","z-z","d₁","w₁","w₂"]
[null,null,"h","b","ts=tg=r1","r2","r3","C","h-c","ديواره",null,null,"Iу","Wy","iy","Iz","Wz","iz"]
[null,null,"mm","mm","mm","mm","mm","mm","mm","cm²","kg/m","cm","cm⁴","cm³","cm","cm⁴","cm³","cm","mm","mm","mm"]
["T",30,30,30,4,2,1,9,21,2.2599999999999998,1.77,0.85,1.72,0.8,0.87,0.87,0.57999999999999996,0.62]
[null,35,35,35,4.5,2.5,1,10,25,2.97,2.33,0.99,3.1,1.23,1.04,1.57,0.9,0.73]
[null,40,40,40,5,2.5,1,11,29,3.77,2.96,1.1200000000000001,5.28,1.84,1.18,2.58,1.29,0.83]
[null,50,50,50,6,3,1.5,13,37,5.66,4.4400000000000004,1.39,12.1,3.36,1.46,6.06,2.42,1.03]
[null,60,60,60,7,3.5,2,15,45,7.94,6.23,1.66,23.8,5.48,1.73,12.2,4.07,1.24]
[null,70,70,70,8,4,2,17,53,10.6,8.32,1.94,44.4,8.7899999999999991,2.0499999999999998,22.1,6.32,1.44]
[null,80,80,80,9,4.5,2,19,61,13.6,10.7,2.2200000000000002,73.7,12.8,2.33,37,9.25,1.65]
[null,100,100,100,11,5.5,3,23,77,20.9,16.399999999999999,2.74,179,24.6,2.92,88.3,17.7,2.0499999999999998]
[null,120,120,120,13,6.5,3,27,93,29.6,23.2,3.28,366,42,3.51,178,29.7,2.4500000000000002]
[null,140,140,140,15,7.5,4,31,109,39.9,31.2,3.8,660,64.7,4.07,330,47.2,2.88]

{"sheet":"نبشي_بال_نامساوي","index":4,"n_rows":93,"n_cols":24,"rows_kept":93,"cut":false,"hidden":false,"merged":[[4,0,49,0],[51,0,92,0],[0,19,0,23],[2,1,3,1],[50,1,50,23],[93,1,93,23],[2,8,3,8],[0,2,0,3],[0,9,0,16],[1,2,2,2],[1,3,2,3],[1,4,2,4],[1,5,2,5]]}
[null,null,"اندازه به ميليمتر",null,null,null,null,null,null,"براي محور خمش",null,null,null,null,null,null,null,null,null,"سوراخهاي لبه"]
[null,"a*b*s","r₁","r₂","A","G",null,null,"ζ-ζ","y-y","y-y","y-y","z-z","z-z","ƞ-ƞ","ƞ-ƞ","ƞ-ƞ","ζ-ζ","ζ-ζ"]
[null,"علامت اختصاري",null,null,null,null,"ey","ez","tan a","Iу","Wy","iy","Iz","Wz","iz","Iƞ","iƞ","Iζ","iζ","d₁","d₂","w₁","w₂","w₃"]
[null,null,"mm","mm","cm²","kg/m","cm","cm",null,"cm⁴","cm³","cm","cm⁴","cm³","cm","cm⁴","cm","cm⁴","cm","mm","mm","mm","mm","mm"]
["بال_نامساوي","30*20*3",4,2,1.43,1.1200000000000001,0.99,0.502,0.42699999999999999,1.25,0.621,0.93500000000000005,0.437,0.29199999999999998,0.55300000000000005,1.43,1,0.25600000000000001,0.42399999999999999,8.4,4.3,17,null,12]
[null,"30*20*4",4,2,1.86,1.46,1.03,0.54100000000000004,0.42099999999999999,1.59,0.80700000000000005,0.92500000000000004,0.55300000000000005,0.379,0.54600000000000004,1.81,0.98799999999999999,0.33,0.42099999999999999,8.4,4.3,17,null,12]
[null,"40*20*4",4,2,2.2599999999999998,1.77,1.47,0.48,0.252,3.59,1.42,1.26,0.6,0.39300000000000002,0.51400000000000001,3.8,1.3,0.39300000000000002,0.41699999999999998,11,4.3,22,null,12]
[null,"40*25*4",4,2,2.46,1.93,1.36,0.623,0.38,3.89,1.47,1.26,1.1599999999999999,0.61899999999999999,0.68700000000000006,4.3499999999999996,1.33,0.7,0.53400000000000003,11,6.4,22,null,15]
[null,"45*30*4",4.5,2.25,2.87,2.25,1.48,0.74,0.436,5.78,1.91,1.42,2.0499999999999998,0.91,0.85,6.65,1.52,1.18,0.64,13,8.4,25,null,17]
[null,"50*30*5",5,2.5,3.78,2.96,1.73,0.74099999999999999,0.35199999999999998,9.36,2.86,1.57,2.5099999999999998,1.1100000000000001,0.81599999999999995,10.3,1.65,1.54,0.63900000000000001,13,8.4,30,null,17]
[null,"60*30*5",5,2.5,4.28,3.36,2.17,0.68400000000000005,0.25700000000000001,15.6,4.07,1.91,2.63,1.1399999999999999,0.78400000000000003,16.5,1.97,1.71,0.63300000000000001,17,8.4,35,null,17]
[null,"60*40*5",6,3,4.79,3.76,1.96,0.97199999999999998,0.434,17.2,4.25,1.89,6.11,2.02,1.1299999999999999,19.7,2.0299999999999998,3.54,0.86,17,11,35,null,22]
[null,"60*40*6",6,3,5.68,4.46,2,1.01,0.43099999999999999,20.100000000000001,5.03,1.88,7.12,2.38,1.1200000000000001,23.1,2.02,4.16,0.85499999999999998,17,11,35,null,22]
[null,"65*50*5",6,3,5.54,4.3499999999999996,1.99,1.25,0.57699999999999996,23.2,5.14,2.0499999999999998,11.9,3.19,1.47,28.8,2.2799999999999998,6.32,1.07,21,13,35,null,30]
[null,"70*50*6",7,3.5,6.89,5.41,2.23,1.25,0.5,33.4,7.01,2.2000000000000002,14.2,3.78,1.43,39.700000000000003,2.4,7.92,1.07,21,13,40,null,30]
[null,"75*50*6",7,3.5,7.19,5.65,2.44,1.21,0.435,40.5,8.01,2.37,14.4,3.81,1.42,46.6,2.5499999999999998,8.36,1.08,23,13,35,null,30]
[null,"75*50*8",7,3.5,9.41,7.39,2.52,1.29,0.43,52,10.4,2.35,18.399999999999999,4.95,1.4,59.6,2.52,10.8,1.07,23,13,35,null,30]
[null,"80*40*6",7,3.5,6.89,5.41,2.85,0.88400000000000001,0.25800000000000001,44.9,8.73,2.5499999999999998,7.59,2.44,1.05,47.6,2.63,4.93,0.84499999999999997,23,11,45,null,22]
[null,"80*40*8",7,3.5,9.01,7.07,2.94,0.96299999999999997,0.253,57.6,11.4,2.5299999999999998,9.61,3.16,1.03,60.9,2.6,6.34,0.83799999999999997,23,11,45,null,22]
[null,"80*60*7",8,4,9.3800000000000008,7.36,2.5099999999999998,1.52,0.54600000000000004,59,10.7,2.5099999999999998,28.4,6.34,1.74,72,2.77,15.4,1.28,23,17,45,null,35]
[null,"100*50*6",8,4,8.7100000000000009,6.84,3.51,1.05,0.26200000000000001,89.9,13.8,3.21,15.4,3.89,1.33,95.4,3.31,9.92,1.07,25,13,55,null,30]
[null,"100*50*8",8,4,11.4,8.9700000000000006,3.6,1.1299999999999999,0.25800000000000001,116,18.2,3.19,19.7,5.08,1.31,123,3.28,12.8,1.06,25,13,55,null,30]
[null,"100*65*7",10,5,11.2,8.77,3.23,1.51,0.41499999999999998,113,16.600000000000001,3.17,37.6,7.53,1.83,128,3.39,22,1.4,25,21,55,null,35]
[null,"100*65*8",10,5,12.7,9.94,3.27,1.55,0.41299999999999998,127,18.899999999999999,3.16,42.2,8.5399999999999991,1.83,144,3.37,24.8,1.4,25,null,55,null,35]
[null,"100*65*10",10,5,15.6,12.3,3.36,1.63,0.41,154,23.2,3.14,51,10.5,1.81,175,3.35,30.1,1.39,25,21,55]
[null,"100*75*8",10,5,13.5,10.6,3.1,1.87,0.54700000000000004,133,19.3,3.14,64.099999999999994,11.4,2.1800000000000002,162,3.47,34.6,1.6,25,23,55,null,40]
[null,"100*75*10",10,5,16.600000000000001,13,3.19,1.95,0.54400000000000004,162,23.8,3.12,77.599999999999994,14,2.16,197,3.45,42.2,1.59,25,null,55,null,40]
[null,"100*75*12",10,5,19.7,15.4,3.27,2.0299999999999998,0.54,189,28,3.1,90.2,16.5,2.14,230,3.42,49.5,1.59,25]
[null,"120*80*8",11,5.5,15.5,12.2,3.83,1.87,0.437,226,27.6,3.82,80.8,13.2,2.2799999999999998,260,4.0999999999999996,46.6,1.74,25,23,50,80,45]
[null,"120*80*10",11,5.5,19.100000000000001,15,3.92,1.95,0.435,276,34.1,3.8,98.1,16.2,2.2599999999999998,317,4.07,56.8,1.72,25,23,50,80,45]
[null,"120*80*12",11,5.5,22.7,17.8,4,2.0299999999999998,0.43099999999999999,32,40.4,3.77,114,19.100000000000001,2.2400000000000002,371,4.04,66.7,1.71,25,23,50,80,45]
[null,"125*75*8",11,5.5,15.5,12.2,4.1399999999999997,1.68,0.36,247,29.6,4,67.599999999999994,11.6,2.09,274,4.21,40.9,1.63,25,null,50]
[null,"125*75*10",11,5.5,19.100000000000001,15,4.2300000000000004,1.76,0.35699999999999998,302,36.5,3.97,82.1,14.3,2.0699999999999998,334,4.18,49.9,1.61,25,null,50]
[null,"125*75*12",11,5.5,27.7,17.8,4.3099999999999996,1.84,0.35399999999999998,354,43.2,3.95,95.5,16.899999999999999,2.0499999999999998,391,4.1500000000000004,58.5,1.61,25,null,50]
[null,"135*65*8",11,5.5,15.5,12.2,4.78,1.34,0.245,291,33.4,4.34,45.2,8.75,1.71,307,4.45,29.4,1.38]
[null,"135*65*10",11,5.5,19.100000000000001,15,4.88,1.42,0.24299999999999999,356,41.3,4.3099999999999996,54.7,10.8,1.69,375,4.43,35.9,1.37]
[null,"150*75*9",12,6,19.600000000000001,15.4,5.26,1.57,0.26100000000000001,455,46.7,4.82,77.900000000000006,13.1,1.99,483,4.96,50.2,1.6,28,23,60,105,40]
[null,"150*75*10",12,6,21.7,17,5.31,1.61,0.26100000000000001,501,51.6,4.8099999999999996,85.6,14.5,1.99,531,4.95,55.1,1.6,28,null,60,105,40]
[null,"150*75*12",12,6,25.7,20.2,5.4,1.69,0.25800000000000001,588,61.3,4.78,99.6,17.100000000000001,1.97,623,4.92,64.7,1.59,28]
[null,"150*75*15",12,6,31.7,24.8,5.52,1.81,0.253,713,75.2,4.75,119,21,1.94,753,4.88,78.599999999999994,1.58,28]
[null,"150*90*10",12,6,23.2,18.2,5,2.04,0.36,533,53.3,4.8,146,21,2.5099999999999998,591,5.05,88.3,1.95,28,25,60,105,50]
[null,"150*90*12",12,6,27.5,21.6,5.08,2.12,0.35799999999999998,627,63.3,4.7699999999999996,171,24.8,2.4900000000000002,694,5.0199999999999996,104,1.94,28,25,60,105,50]
[null,"150*90*15",12,6,33.9,26.6,5.21,2.23,0.35399999999999998,761,77.7,4.74,205,30.4,2.46,841,4.9800000000000004,126,1.93,28,25,60]
[null,"150*100*10",12,6,24.2,19,4.8099999999999996,2.34,0.438,553,54.2,4.79,199,25.9,2.87,637,5.13,114,2.17,28,25,60,105,55]
[null,"150*100*12",12,6,28.7,22.5,4.8899999999999997,2.42,0.436,651,64.400000000000006,4.76,233,30.7,2.85,749,5.1100000000000003,134,2.16,28,25,60,105,55]
[null,"200*100*10",15,7.5,29.2,23,6.93,2.0099999999999998,0.26300000000000001,1220,93.2,6.46,210,26.3,2.68,1290,6.65,135,2.15,28,25,65,150,55]
[null,"200*100*12",15,7.5,34.799999999999997,27.3,7.03,2.1,0.26200000000000001,1440,111,6.43,247,31.3,2.67,1530,6.63,159,2.14,28,25,65,150,55]
[null,"200*100*15",15,7.5,43,33.75,7.16,2.2200000000000002,0.26,1758,137,6.4,299,38.5,2.64,1864,6.59,193,2.12,28,25,65,150,55]
[null,"200*150*12",15,7.5,40.799999999999997,32,6.08,3.61,0.55200000000000005,1650,119,6.36,803,70.5,4.4400000000000004,2030,7.04,430,3.25]
[null,"200*150*15",15,7.5,50.5,39.6,6.21,3.73,0.55100000000000005,2022,147,6.33,979,86.9,4.4000000000000004,2476,7,526,3.23]
[]
["بال_نامساوي_غيراستاندارد","40*20*3",3.5,2,1.72,1.35,1.43,0.44,0.25900000000000001,2.79,1.08,1.27,0.47,0.3,0.52,2.96,1.31,0.3,0.42,11,4.3,22,"_",12]
[null,"45*30*3",4.5,2,2.19,1.72,1.43,0.7,0.436,4.47,1.46,1.43,1.6,0.7,0.86,5.15,1.53,0.93,0.65,13,8.4,25,"_",17]
[null,"45*30*5",4.5,2,3.53,2.77,1.52,0.78,0.43,6.99,2.35,1.41,2.4700000000000002,1.1100000000000001,0.84,8.02,1.51,1.44,0.64,13,8.4,25,"_",17]
[null,"50*30*4",4.5,2,3.07,2.41,1.68,0.7,0.35599999999999998,7.71,2.33,1.59,2.09,0.91,0.82,8.5299999999999994,1.67,1.27,0.64,13,8.4,30,"_",17]
[null,"50*40*4",4,2,3.46,2.71,1.52,1.03,0.629,8.5399999999999991,2.4700000000000002,1.57,4.8600000000000003,1.64,1.19,10.9,1.78,2.46,0.84,13,11,30,"_",22]
[null,"50*40*5",4,2,4.2699999999999996,3.35,1.56,1.07,0.625,10.4,3.02,1.56,5.89,2.0099999999999998,1.18,13.3,1.76,3.02,0.84,13,11,30,"_",22]
[null,"60*40*7",6,3,6.55,5.14,2.04,1.05,0.42899999999999999,23,5.79,1.87,8.07,2.74,1.1100000000000001,26.3,2,4.37,0.85,17,11,35,"_",22]
[null,"65*50*7",6,3,7.6,5.97,2.0699999999999998,1.33,0.57399999999999995,31,6.99,2.02,15.8,4.3099999999999996,1.44,38.4,2.25,8.3699999999999992,1.05,21,13,35,"_",30]
[null,"65*50*9",6,3,9.58,7.52,2.15,1.41,0.56699999999999995,38.200000000000003,8.77,2,19.399999999999999,5.39,1.42,47,2.2200000000000002,10.5,1.05,21,13,35,"_",30]
[null,"75*50*9",6.5,3.5,10.5,8.23,2.56,1.32,0.42699999999999999,57.4,11.6,2.34,20.2,5.49,1.39,65.7,2.5,11.9,1.07,23,13,40,"_",30]
[null,"75*55*5",7,3.5,6.3,4.95,2.31,1.33,0.53,35.5,6.84,2.37,16.2,3.89,1.6,43.1,2.61,8.68,1.17,23,17,40,"_",30]
[null,"75*55*7",7,3.5,8.66,6.8,2.4,1.41,0.52500000000000002,47.9,9.39,2.35,21.8,5.32,1.59,57.9,2.59,11.8,1.17,23,17,40,"_",30]
[null,"75*55*9",7,3.5,10.9,8.59,2.4700000000000002,1.48,0.51800000000000002,59.4,11.8,2.33,26.8,6.66,1.57,71.3,2.5499999999999998,14.8,1.1599999999999999,23,17,40,"_",30]
[null,"80*65*6",8,4,8.41,6.6,2.39,1.65,0.64900000000000002,52.8,9.41,2.5099999999999998,31.2,6.44,1.93,68.5,2.85,15.6,1.36,23,21,45,"_",35]
[null,"80*65*8",8,4,11,8.66,2.4700000000000002,1.73,0.64500000000000002,68.099999999999994,12.3,2.4900000000000002,40.1,8.41,1.91,88,2.82,20.3,1.36,23,21,45,"_",35]
[null,"80*65*10",8,4,13.6,10.7,2.5499999999999998,1.81,0.64,82.2,15.1,2.46,48.3,10.3,1.89,106,2.79,24.8,1.35,23,21,45,"_",35]
[null,"90*60*6",7,3.5,8.69,6.82,2.89,1.41,0.442,71.7,11.7,2.87,25.8,5.61,1.72,82.8,3.09,14.6,1.3,25,17,50,"_",35]
[null,"90*60*8",7,3.5,11.4,8.9600000000000009,2.97,1.49,0.437,92.5,15.4,2.85,33,7.31,1.7,107,3.06,19,1.29,25,17,50,"_",35]
[null,"100*50*10",9,4.5,14.1,11.1,3.67,1.2,0.252,141,22.2,3.16,23.4,6.17,1.29,149,3.25,15.5,1.04,25,13,55,"_",30]
[null,"100*65*9",10,5,14.2,11.1,3.32,1.59,0.41499999999999998,141,21,3.15,46.7,9.52,1.82,160,3.36,27.2,1.39,25,21,55,"_",35]
[null,"100*65*11",10,5,17.100000000000001,13.4,3.4,1.67,0.41,167,25.3,3.13,55.1,11.4,1.8,190,3.34,32.6,1.38,25,21,55,"_",35]
[null,"100*75*7",10,5,11.9,9.32,3.06,1.83,0.55300000000000005,118,17,3.15,56.9,10,2.19,145,3.49,30.1,1.59,25,23,55,"_",40]
[null,"100*75*9",10,5,15.1,11.8,3.15,1.91,0.54900000000000004,148,21.5,3.13,71,12.7,2.17,181,3.47,37.799999999999997,1.59,25,23,55,"_",40]
[null,"100*75*11",10,5,18.2,14.3,3.23,1.99,0.54500000000000004,176,25.9,3.11,84,15.3,2.15,214,3.44,45.4,1.58,25,23,55,"_",40]
[null,"120*80*14",11,5.5,26.2,20.5,4.08,2.1,0.42899999999999999,368,46.4,3.75,130,22,2.23,421,4.01,75.8,1.7,25,23,50,80,45]
[null,"130*65*8",11,5.5,15.1,11.9,4.5599999999999996,1.37,0.26300000000000001,263,31.1,4.17,44.8,8.7200000000000006,1.72,280,4.3099999999999996,28.6,1.38,25,21,50,90,35]
[null,"130*65*10",11,5.5,18.600000000000001,14.6,4.6500000000000004,1.45,0.25900000000000001,321,38.4,4.1500000000000004,54.2,10.7,1.71,340,4.2699999999999996,35,1.37,25,21,50,90,35]
[null,"130*65*12",11,5.5,22.1,17.3,4.74,1.53,0.255,376,45.5,4.12,63,12.7,1.69,397,4.24,41.2,1.37,25,21,50,90,35]
[null,"130*90*12",12,6,25.1,19.7,4.24,2.2599999999999998,0.46800000000000003,420,48,4.09,165,24.4,2.56,492,4.43,92.6,1.92,25,25,50,90,50]
[null,"150*75*11",10.5,5.5,23.6,18.600000000000001,5.37,1.65,0.26100000000000001,545,56.6,4.8,93,15.9,1.98,578,4.95,59.8,1.59,28,23,60,105,40]
[null,"150*90*11",12,6,25.3,19.899999999999999,5.04,2.08,0.36,581,58.3,4.79,159,22.9,2.5,644,5.04,95.7,1.94,28,25,60,105,50]
[null,"150*100*14",13,6.5,33.200000000000003,26.1,4.97,2.5,0.435,744,74.099999999999994,4.7300000000000004,264,35.200000000000003,2.82,856,5.07,152,2.14,28,25,60,105,55]
[null,"160*80*10",13,6.5,23.2,18.2,5.63,1.69,0.26200000000000001,611,58.9,5.14,104,16.5,2.12,649,5.29,67,1.7,28,23,60,115,45]
[null,"160*80*12",13,6.5,27.5,21.6,5.72,1.77,0.25900000000000001,720,70,5.1100000000000003,122,19.600000000000001,2.1,763,5.26,78.900000000000006,1.69,28,23,60,115,45]
[null,"180*90*10",14,7,26.2,20.6,6.28,1.85,0.26200000000000001,880,75.099999999999994,5.8,151,21.2,2.4,934,5.97,97.4,1.93,28,25,60,135,50]
[null,"180*90*12",14,7,31.2,24.5,6.37,1.93,0.26100000000000001,1040,89.3,5.77,177,25.1,2.38,1100,5.94,114,1.92,28,25,60,135,50]
[null,"200*100*14",15,7.5,40.299999999999997,31.6,7.12,2.1800000000000002,0.26200000000000001,1650,128,6.41,282,36.1,2.65,1760,6.6,181,2.12,28,25,65,150,55]
[null,"200*100*16",15,7.5,45.7,35.9,7.2,2.36,0.25900000000000001,1860,145,6.38,316,40.799999999999997,2.63,1970,6.57,204,2.11,28,25,65,150,55]
[null,"250*90*10",15,7.5,33.200000000000003,26.1,9.4499999999999993,1.56,0.154,2170,140,8.08,161,21.7,2.2000000000000002,2220,8.17,112,1.84,28,25,65,200,50]
[null,"250*90*12",15,7.5,39.6,31.1,9.5500000000000007,1.65,0.153,2570,166,8.0500000000000007,189,25.8,2.19,2630,8.14,132,1.83,28,25,65,200,50]
[null,"250*90*14",15,7.5,45.9,36,9.65,1.73,0.152,2960,192,8.0299999999999994,216,29.7,2.17,3020,8.11,152,1.82,28,25,65,200,50]
[null,"250*90*16",15,7.5,52.1,40.9,9.74,1.81,0.15,3330,218,8,342,33.6,2.15,3400,8.08,171,1.81,28,25,65,200,50]

{"sheet":"نبشي_بال_مساوي","index":5,"n_rows":83,"n_cols":20,"rows_kept":83,"cut":false,"hidden":false,"merged":[[4,0,47,0],[49,0,82,0],[0,2,0,3],[0,9,0,16],[0,6,1,8],[1,2,2,2],[1,3,2,3],[1,4,2,4],[1,19,2,19],[83,1,83,19],[48,1,48,19],[1,5,2,5],[2,1,3,1],[1,17,2,17],[1,18,2,18]]}
[null,null,"اندازه به ميليمتر",null,null,null,null,null,null,"براي محور خمش"]
[null,"a*s","r₁","r₂","A","G",null,null,null,"y-y=z-z","y-y=z-z","y-y=z-z","ƞ-ƞ","ƞ-ƞ","ζ-ζ","ζ-ζ","ζ-ζ","d₁","w₁","w₂"]
[null,"علامت اختصاري",null,null,null,null,"e","w","v₁","Iу=Iz","Wy=Wz","iy=iz","Iƞ","iƞ","Iζ","Wζ","iζ"]
[null,null,"mm","mm","cm²","kg/m","cm","cm","cm","cm⁴","cm³","cm","cm⁴","cm","cm⁴","cm³","cm","mm","mm","mm"]
["بال_مساوي","20*3",3.5,1.75,1.1200000000000001,0.88200000000000001,0.59799999999999998,1.41,0.84599999999999997,0.39200000000000002,0.27900000000000003,0.59,0.61799999999999999,0.74199999999999999,0.16500000000000001,0.19500000000000001,0.38300000000000001,4.3,12]
[null,"25*3",3.5,1.75,1.42,1.1200000000000001,0.72299999999999998,1.77,1.02,0.80300000000000005,0.45200000000000001,0.751,1.27,0.94499999999999995,0.33400000000000002,0.32600000000000001,0.48399999999999999,6.4,15]
[null,"25*4",3.5,1.75,1.85,1.45,0.76200000000000001,1.77,1.08,1.02,0.58599999999999997,0.74099999999999999,1.61,0.93100000000000005,0.43,0.33900000000000002,0.48199999999999998,6.4,15]
[null,"30*3",5,2.5,1.74,1.36,0.83499999999999996,2.12,1.18,1.4,0.64900000000000002,0.89900000000000002,2.2200000000000002,1.1299999999999999,0.58499999999999996,0.496,0.58099999999999996,8.4,17]
[null,"30*4",5,2.5,2.27,1.78,0.878,2.12,1.24,1.8,0.85,0.89200000000000002,2.85,1.1200000000000001,0.754,0.60699999999999998,0.57699999999999996,8.4,17]
[null,"35*4",5,2.5,2.67,2.09,1,2.4700000000000002,1.42,2.95,1.18,1.05,4.68,1.32,1.23,0.86499999999999999,0.67800000000000005,11,18]
[null,"40*4",6,3,3.08,2.42,1.1200000000000001,2.83,1.58,4.47,1.55,1.21,7.09,1.52,1.86,1.17,0.77700000000000002,11,22]
[null,"40*5",6,3,3.79,2.97,1.1599999999999999,2.83,1.64,5.43,1.91,1.2,8.6,1.51,2.2599999999999998,1.38,0.77300000000000002,11,22]
[null,"45*4.5",7,3.5,3.9,3.06,1.25,3.18,1.78,7.14,2.2000000000000002,1.35,11.4,1.71,2.94,1.65,0.87,13,25]
[null,"50*4",7,3.5,3.89,3.06,1.36,3.54,1.92,8.9700000000000006,2.46,1.52,14.2,1.91,3.73,1.94,0.97899999999999998,13,30]
[null,"50*5",7,3.5,4.8,3.77,1.4,3.54,1.99,11,3.05,1.51,17.399999999999999,1.9,4.55,2.29,0.97299999999999998,13,30]
[null,"50*6",7,3.5,5.69,4.47,1.45,3.54,2.04,12.8,3.61,1.5,20.3,1.89,5.34,2.61,0.96799999999999997,13,30]
[null,"60*5",8,4,5.82,4.57,1.64,4.24,2.3199999999999998,19.399999999999999,4.45,1.82,30.7,2.2999999999999998,8.0299999999999994,3.46,1.17,17,35]
[null,"60*6",8,4,6.91,5.42,1.69,4.24,2.39,22.8,5.29,1.82,36.1,2.29,9.44,3.96,1.17,17,35]
[null,"60*8",8,4,9.0299999999999994,7.09,1.77,4.24,2.5,29.2,6.89,1.8,46.1,2.2599999999999998,12.2,4.8600000000000003,1.1599999999999999,17,35]
[null,"65*7",9,4.5,8.6999999999999993,6.83,1.85,4.5999999999999996,2.62,33.4,7.18,1.96,53,2.4700000000000002,13.8,5.27,1.26,21,35]
[null,"70*6",9,4.5,8.1300000000000008,6.38,1.93,4.95,2.73,36.9,7.27,2.13,58.5,2.68,15.3,5.6,1.37,21,40]
[null,"70*7",9,4.5,9.4,7.38,1.97,4.95,2.79,42.3,8.41,2.12,67.099999999999994,2.67,17.5,6.28,1.36,21,40]
[null,"75*6",9,4.5,8.73,6.85,2.0499999999999998,5.3,2.9,45.8,8.41,2.29,72.7,2.89,18.899999999999999,6.53,1.47,23,40]
[null,"75*8",9,4.5,11.4,8.99,2.14,5.3,3.02,59.1,11,2.27,93.8,2.86,24.5,8.09,1.46,23,40]
[null,"80*8",10,5,12.3,9.6300000000000008,2.2599999999999998,5.66,3.19,72.2,12.6,2.4300000000000002,115,3.06,29.9,9.3699999999999992,1.56,23,45]
[null,"80*10",10,5,15.1,11.9,2.34,5.66,3.3,87.5,15.4,2.41,139,3.03,36.4,11,1.55,23,45]
[null,"90*7",11,5.5,12.2,9.61,2.4500000000000002,6.36,3.47,92.6,14.1,2.75,147,3.46,38.299999999999997,11,1.77,25,50]
[null,"90*8",11,5.5,13.9,10.9,2.5,6.36,3.53,104,16.100000000000001,2.74,166,3.45,43.1,12.2,1.76,25,50]
[null,"90*9",11,5.5,15.5,12.2,2.54,6.36,3.59,116,17.899999999999999,2.73,184,3.44,47.9,13.3,1.76,25,50]
[null,"90*10",11,5.5,17.100000000000001,13.4,2.58,6.36,3.65,127,19.8,2.72,201,3.42,52.6,14.4,1.75,25,50]
[null,"100*8",12,6,15.5,12.2,2.74,7.07,3.87,145,19.899999999999999,3.06,230,3.85,59.9,15.5,1.96,25,55]
[null,"100*10",12,6,19.2,15,2.82,7.07,3.99,177,24.6,3.04,280,3.83,73,18.3,1.95,25,55]
[null,"100*12",12,6,22.7,17.8,2.9,7.07,4.1100000000000003,207,29.1,3.02,328,3.8,85.7,20.9,1.94,25,55]
[null,"120*10",13,6.5,23.2,18.2,3.31,8.49,4.6900000000000004,313,36,3.67,497,4.68,129,27.5,2.36,25,50]
[null,"120*12",13,6.5,27.5,21.6,3.4,8.49,4.8,368,42.7,3.65,584,4.5999999999999996,152,31.6,2.35,25,50]
[null,"130*12",14,7,30,23.6,3.64,9.19,5.15,472,50.4,3.97,750,5,194,37.700000000000003,2.54,25,50]
[null,"150*10",16,8,29.3,23,4.03,10.6,5.71,624,56.9,4.62,990,5.82,258,45.1,2.97,28,60]
[null,"150*12",16,8,34.799999999999997,27.3,4.12,10.6,5.83,737,67.7,4.5999999999999996,1170,5.8,303,52,2.95,28,60]
[null,"150*15",16,8,43,33.799999999999997,4.25,10.6,6.01,898,83.5,4.57,1430,5.76,370,61.6,2.93,28,60]
[null,"160*15",17,8.5,46.1,36.200000000000003,4.49,11.3,6.35,1100,95.6,4.88,1750,6.15,453,71.3,3.14,28,60]
[null,"180*16",18,9,55.4,43.5,5.0199999999999996,12.7,7.11,1680,130,5.51,2690,6.96,679,95.5,3.5,28,60]
[null,"180*18",18,9,61.9,48.6,5.0999999999999996,12.7,7.22,1870,145,5.49,2960,6.92,768,106,3.52,28,60]
[null,"200*16",18,9,61.8,48.5,5.52,14.1,7.81,2340,162,6.16,3720,7.76,960,123,3.94,28,65]
[null,"200*18",18,9,69.099999999999994,54.3,5.6,14.1,7.92,2600,181,6.13,4150,7.75,1050,133,3.9,28,65]
[null,"200*20",18,9,76.3,59.9,5.68,14.1,8.0399999999999991,2850,199,6.11,4530,7.7,1170,146,3.92,28,65]
[null,"200*24",18,9,90.6,71.099999999999994,5.84,14.1,8.26,3300,235,6.06,5280,7.64,1380,167,3.9,28,65]
[null,"250*28",18,9,133,104,7.24,17.7,10.199999999999999,7700,433,7.62,12200,9.61,3170,309,4.8899999999999997,28,75]
[null,"250*35",18,9,163,128,7.5,17.7,10.6,9260,529,7.54,14700,9.48,3860,364,4.87,28,75]
[]
["بال_مساوي_غيراستاندارد","30*5",5,2.5,2.78,2.1800000000000002,0.92,2.12,1.3,2.16,1.04,0.88,3.41,1.1100000000000001,0.91,0.7,0.56999999999999995,8.4,17,"_"]
[null,"35*5",5,2.5,3.28,2.57,1.04,2.4700000000000002,1.47,3.56,1.45,1.04,5.63,1.31,1.49,1.01,0.67,11,18,"_"]
[null,"45*4",7,3.5,3.49,2.74,1.23,3.18,1.75,6.43,1.97,1.36,10.199999999999999,1.71,2.68,1.53,0.88,13,25,"_"]
[null,"45*5",7,3.5,4.3,3.38,1.28,3.18,1.81,7.83,2.4300000000000002,1.35,12.4,1.7,3.25,1.8,0.87,13,25,"_"]
[null,"50*7",7,3.5,6.56,5.15,1.49,3.54,2.11,14.6,4.1500000000000004,1.49,23.1,1.88,6.02,2.85,0.96,13,30,"_"]
[null,"55*6",8,4,6.31,4.95,1.56,3.89,2.21,17.3,4.4000000000000004,1.66,27.4,2.08,7.24,3.28,1.07,17,30,"_"]
[null,"70*9",9,4.5,11.9,9.34,2.0499999999999998,4.95,2.9,52.6,10.6,2.1,83.1,2.64,22,7.59,1.36,21,40,"_"]
[null,"75*7",10,5,10.1,7.94,2.09,5.3,2.95,52.4,9.67,2.2799999999999998,83.6,2.88,21.1,7.15,1.45,23,40,"_"]
[null,"80*6",10,5,9.35,7.34,2.17,5.66,3.07,55.8,9.57,2.44,88.5,3.08,23.1,7.54,1.57,23,45,"_"]
[null,"100*14",12,6,26.2,20.6,2.98,7.07,4.21,235,33.5,3,372,3.77,98.3,23.4,1.94,25,55,"_"]
[null,"110*10",12,6,21.2,16.600000000000001,3.07,7.78,4.34,239,30.1,3.36,379,4.2300000000000004,98.6,22.7,2.16,25,45,70]
[null,"110*12",13,6.5,25.1,19.7,3.15,7.78,4.45,279,35.5,3.33,443,4.2,115,25.8,2.14,25,45,70]
[null,"120*11",13,6.5,25.4,19.899999999999999,3.36,8.49,4.75,341,39.5,3.66,541,4.62,140,29.5,2.35,25,50,80]
[null,"120*13",13,6.5,29.7,23.3,3.44,8.49,4.8600000000000003,394,46,3.64,626,4.59,162,33.4,2.34,25,50,80]
[null,"120*15",13,6.5,33.9,26.6,3.51,8.49,4.97,445,52.4,3.62,706,4.5599999999999996,184,37,2.33,25,50,80]
[null,"140*10",null,null,27.2,21.4,3.79,null,5.37,504,49.3,4.3,802,5.43,207,38.5,2.76,28,55,95]
[null,"140*13",15,7.5,35,27.5,3.92,9.9,5.54,638,63.3,4.2699999999999996,1010,5.38,262,47.3,2.74,28,55,95]
[null,"140*15",15,7.5,40,31.4,4,9.9,5.66,723,72.3,4.25,1150,5.36,298,52.7,2.73,28,55,95]
[null,"150*14",16,8,40.299999999999997,31.6,4.21,10.6,5.95,845,78.2,4.58,1340,5.77,347,58.3,2.94,28,60,105]
[null,"150*16",16,8,45.7,35.9,4.29,10.6,6.07,948,88.7,4.5599999999999996,1510,5.74,391,64.400000000000006,2.93,28,60,105]
[null,"150*18",16,8,51,40.1,4.3600000000000003,10.6,6.17,1050,99.3,4.54,1670,5.7,438,71,2.93,28,60,105]
[null,"150*20",16,8,56.3,44.2,4.4400000000000004,10.6,6.28,1150,100,4.51,1820,5.68,477,76,2.91,28,60,105]
[null,"160*17",17,8.5,51.8,40.700000000000003,4.57,11.3,6.46,1230,108,4.8600000000000003,1950,6.13,506,78.3,3.13,28,60,115]
[null,"160*19",17,8.5,57.5,45.1,4.6500000000000004,11.3,6.58,1350,118,4.84,2140,6.16,558,84.8,3.12,28,60,115]
[null,"180*20",18,9,68.400000000000006,53.7,5.18,12.7,7.33,2040,160,5.47,3260,6.9,830,113,3.49,28,60,135]
[null,"180*22",18,9,74.7,58.6,5.26,12.7,7.44,2210,174,5.44,3510,6.86,918,123,3.5,28,60,135]
[null,"200*22",18,9,83.5,65.599999999999994,5.76,14.1,8.14,3094,217,6.09,4913,7.67,1276,156,3.91,28,65,150]
[null,"200*26",18,9,97.6,76.599999999999994,5.91,14.1,8.36,3560,253,6.04,5642,7.61,1479,176,3.89,28,70,150]
[null,"200*28",18,9,105,82,5.99,14.1,8.4700000000000006,3780,270,6.02,5990,7.57,1580,186,3.89,28,70,150]
[null,"250*18",20,10,87.2,68.400000000000006,6.84,17.7,9.67,5213,287,7.73,8294,9.75,2132,220,4.95,28,70,200]
[null,"250*20",20,10,96.4,75.7,6.92,17.7,9.7899999999999991,5732,317,7.71,9118,9.73,2345,240,4.93,28,70,200]
[null,"250*22",20,10,106,82.9,7,17.7,9.9,6237,347,7.69,9921,9.69,2554,257,4.92,28,70,200]
[null,"250*24",20,10,115,90,7.08,17.7,10,6732,376,7.66,10703,9.66,2761,276,4.91,28,70,200]
[null,"250*26",20,10,124,97.1,7.16,17.7,10.1,7214,404,7.64,11464,9.6300000000000008,2965,293,4.9000000000000004,28,75,200]

{"sheet":"قوطي_مربع","index":6,"n_rows":142,"n_cols":8,"rows_kept":142,"cut":false,"hidden":false,"merged":[[69,1,69,7],[142,1,142,7],[3,0,68,0],[70,0,141,0]]}
[]
[null,"B","T","A","M","I","W","i"]
[null,"mm","mm","cm²","kg/m","cm⁴","cm³","cm"]
["تــــولــيـــد_گــــــرم",40,3,4.34,3.41,9.7799999999999994,4.8899999999999997,1.5]
[null,40,4,5.59,4.3899999999999997,11.8,5.91,1.45]
[null,50,3,5.54,4.3499999999999996,20.2,8.08,1.91]
[null,50,4,7.19,5.64,25,9.99,1.86]
[null,60,3,6.74,5.29,36.200000000000003,12.1,2.3199999999999998]
[null,60,4,8.7899999999999991,6.9,45.4,15.1,2.27]
[null,60,5,10.7,8.42,53.3,17.8,2.23]
[null,70,3,7.94,6.24,59,16.899999999999999,2.73]
[null,70,4,10.4,8.15,74.7,21.3,2.68]
[null,70,5,12.7,9.99,88.5,25.3,2.64]
[null,80,4,12,9.41,114,28.6,3.09]
[null,80,5,14.7,11.6,137,34.200000000000003,3.05]
[null,80,6.3,18.100000000000001,14.2,156,40.5,2.99]
[null,90,4,13.6,10.7,166,37,3.5]
[null,90,5,16.7,13.1,200,44.4,3.45]
[null,90,6.3,20.7,16.2,238,53,3.4]
[null,100,4,15.2,11.9,232,46.4,3.91]
[null,100,5,18.7,14.7,279,55.9,3.86]
[null,100,6.3,23.2,18.2,336,67.099999999999994,3.8]
[null,120,5,22.7,17.8,498,83,4.68]
[null,120,6.3,28.2,22.2,603,100,4.62]
[null,120,8,35.200000000000003,27.6,726,121,4.55]
[null,120,10,42.9,33.700000000000003,852,142,4.46]
[null,140,5,26.7,21,805,115,5.5]
[null,140,6.3,33.299999999999997,26.1,984,141,5.44]
[null,140,8,41.6,32.6,1195,171,5.36]
[null,140,10,50.9,40,1416,202,5.27]
[null,150,5,28.7,22.6,1002,134,5.9]
[null,150,6.3,35.799999999999997,28.1,1223,163,5.85]
[null,150,8,44.8,35.1,1491,199,5.77]
[null,150,10,54.9,43.1,1773,236,5.68]
[null,160,6.3,38.299999999999997,30.1,1499,187,6.26]
[null,160,8,48,37.6,1831,229,6.18]
[null,160,10,58.9,46.3,2186,273,6.09]
[null,160,12.5,72.099999999999994,56.6,2576,322,5.98]
[null,180,6.3,43.3,34,2168,241,7.07]
[null,180,8,54.4,42.7,2661,296,7]
[null,180,10,66.900000000000006,52.5,3193,355,6.91]
[null,180,12.5,82.1,64.400000000000006,3790,421,6.8]
[null,200,6.3,48.4,38,3011,301,7.89]
[null,200,8,60.8,47.7,3709,371,7.81]
[null,200,10,74.900000000000006,58.8,4471,447,7.72]
[null,200,12.5,92.1,72.3,5336,534,7.61]
[null,220,6.3,53.4,41.9,4049,368,8.7100000000000009]
[null,220,8,67.2,52.7,5002,455,8.6300000000000008]
[null,220,10,82.9,65.099999999999994,6050,550,8.5399999999999991]
[null,220,12.5,102,80.099999999999994,7254,659,8.43]
[null,250,6.3,61,47.9,6014,481,9.93]
[null,250,8,76.8,60.3,7455,596,9.86]
[null,250,10,94.9,74.5,9055,724,9.77]
[null,250,16,147,115,13267,1061,9.5]
[null,260,8,80,62.8,8423,648,10.3]
[null,260,10,89.9,77.7,10242,788,10.199999999999999]
[null,260,12.5,122,95.8,12365,951,10.1]
[null,260,16,153,120,15061,159,9.91]
[null,300,8,92.8,72.8,13128,875,11.9]
[null,300,10,115,90.2,16026,1068,11.8]
[null,300,12.5,142,112,19442,1296,11.7]
[null,300,16,179,141,23855,1590,11.5]
[null,350,8,109,85.4,21129,1207,13.9]
[null,350,10,135,106,25884,1479,13.9]
[null,350,12.5,167,131,31541,1802,13.7]
[null,350,16,211,166,38942,2225,13.6]
[null,400,10,155,122,39128,1956,15.9]
[null,400,12.5,192,151,47839,2392,15.8]
[null,400,16,243,191,59344,2967,15.6]
[null,"چهار گوش گرم"]
["تـــــــــوليــــــــــد_ســــــــــــــرد",20,2,1.34,1.05,0.69,0.69,0.72]
[null,30,2,2.14,1.68,2.72,1.81,1.1299999999999999]
[null,40,2,2.94,2.31,6.94,3.47,1.54]
[null,40,3,4.21,3.3,9.32,4.66,1.49]
[null,40,4,5.35,4.2,11.1,5.54,1.44]
[null,50,2,3.74,2.93,14.1,5.66,1.95]
[null,50,3,5.41,4.25,19.5,7.79,1.9]
[null,50,4,6.95,5.46,23.7,9.49,1.85]
[null,50,5,8.36,6.56,27,10.8,1.8]
[null,60,2,4.54,3.56,25.1,8.3800000000000008,2.35]
[null,60,3,6.61,5.19,35.1,11.7,2.31]
[null,60,4,8.5500000000000007,6.71,43.6,14.5,2.2599999999999998]
[null,60,5,10.4,8.1300000000000008,50.5,16.8,2.21]
[null,70,3,7.81,6.13,57.5,16.399999999999999,2.71]
[null,70,4,10.1,7.97,72.099999999999994,20.6,2.67]
[null,70,5,12.4,9.6999999999999993,84.6,24.4,2.62]
[null,80,3,9.01,7.07,87.8,22,3.12]
[null,80,4,11.7,9.2200000000000006,111,27.8,3.07]
[null,80,5,14.4,11.3,131,32.9,3.03]
[null,80,6.3,17.2,13.5,149,37.1,2.94]
[null,90,3,10.199999999999999,8.01,127,28.3,3.53]
[null,90,4,13.3,10.5,162,36,3.48]
[null,90,5,16.399999999999999,12.87,193,42.9,3.43]
[null,90,6.3,19.7,15.46,221,49.1,3.35]
[null,100,4,14.9,11.7,226,45.3,3.89]
[null,100,5,18.399999999999999,14.44,271,54.2,3.84]
[null,100,6.3,22.2,17.43,314,62.8,3.76]
[null,120,4,18.100000000000001,14.21,402,67,4.71]
[null,120,5,22.4,17.579999999999998,485,80.900000000000006,4.66]
[null,120,6.3,27.3,21.43,572,95.3,4.58]
[null,120,8,33.6,26.38,677,113,4.49]
[null,140,4,21.3,16.72,652,93.1,5.52]
[null,140,5,26.4,20.72,791,113,5.48]
[null,140,6.3,32.299999999999997,25.36,941,134,5.39]
[null,140,8,40,31.4,1127,161,5.3]
[null,140,10,48.6,38.15,1312,187,5.2]
[null,150,5,28.4,22.29,882,131,5.89]
[null,150,6.3,34.799999999999997,27.32,1174,156,5.8]
[null,150,8,43.2,33.909999999999997,1412,188,5.71]
[null,150,10,52.6,41.29,1653,220,5.61]
[null,160,4,24.5,19.23,987,123,6.34]
[null,160,5,30.4,23.86,1202,150,6.29]
[null,160,6.3,37.4,29.36,1442,180,6.21]
[null,160,8,46.4,36.42,1741,218,6.12]
[null,160,10,56.6,44.43,2048,256,6.02]
[null,180,6.3,42.4,33.28,2096,233,7.03]
[null,180,8,52.8,41.45,2546,283,6.94]
[null,180,10,64.599999999999994,50.71,3017,335,6.84]
[null,180,12.5,77,60.45,3466,378,6.65]
[null,200,6.3,47.4,37.21,2922,292,7.85]
[null,200,8,59.2,46.47,3566,357,7.76]
[null,200,10,72.599999999999994,56.99,4251,425,7.65]
[null,200,12.5,87,68.3,4859,486,7.47]
[null,220,8,65.599999999999994,51.5,4828,439,8.58]
[null,220,10,80.599999999999994,63.27,5782,526,8.4700000000000006]
[null,220,12.5,97,76.150000000000006,6674,607,8.2899999999999991]
[null,250,6.3,60,47.1,5873,470,9.89]
[null,250,8,75.2,59.03,7229,578,9.8000000000000007]
[null,250,10,92.6,72.69,8707,697,9.6999999999999993]
[null,250,12.5,112,87.92,10161,813,9.52]
[null,260,8,78.400000000000006,61.54,8178,629,10.199999999999999]
[null,260,10,96.6,75.83,9865,759,10.1]
[null,260,12.5,117,91.85,11548,888,9.93]
[null,300,6.3,73.599999999999994,57.78,10342,689,11.9]
[null,300,8,91.2,71.59,12801,853,11.8]
[null,300,10,113,88.71,15519,1035,11.7]
[null,300,12.5,137,107.55,18348,1223,11.6]
[null,350,8,107,84,20681,1182,13.9]
[null,350,10,133,104.41,25189,1439,13.8]
[null,350,12.5,162,127.17,30045,1717,13.6]
[null,400,10,153,120.11,38216,1911,15.8]
[null,400,12.5,187,146.80000000000001,45877,2294,15.7]

{"sheet":"قوطي_مستطيل","index":7,"n_rows":148,"n_cols":11,"rows_kept":148,"cut":false,"hidden":false,"merged":[[75,1,75,10],[148,1,148,10],[3,0,74,0],[76,0,147,0]]}
[]
[null,"H*B","T","A","M","Iy","Wy","iy","Iz","Wz","iz"]
[null,"mm","mm","cm²","kg/m","cm⁴","cm³","cm","cm⁴","cm³","cm"]
["تــــــــــوليــــــــــــــــد.گــــــــــــــــــــــــــــــــرم","50*30",3,4.34,3.41,13.6,5.43,1.77,5.94,3.96,1.17]
[null,"50*31",4,5.59,4.3899999999999997,16.5,6.6,1.72,7.08,4.72,1.1299999999999999]
[null,"60*40",3,5.54,4.3499999999999996,26.5,8.82,2.1800000000000002,13.9,6.95,1.58]
[null,"60*41",4,7.19,5.64,32.799999999999997,10.9,2.14,17,8.52,1.54]
[null,"80*40",3,6.74,5.29,54.2,13.6,2.84,18,9,1.63]
[null,"80*41",4,8.7899999999999991,6.9,68.2,17.100000000000001,2.79,22.2,11.1,1.59]
[null,"80*42",5,10.7,8.4,80.3,20.100000000000001,2.74,25.7,12.9,1.55]
[null,"90*50",3,7.94,6.23,84.4,18.8,3.26,33.5,13.4,2.0499999999999998]
[null,"90*51",4,10.4,8.16,107,23.8,3.21,41.9,16.8,2.0099999999999998]
[null,"90*52",5,12.7,9.9700000000000006,127,28.3,3.16,49.2,19.7,1.97]
[null,"100*50",4,11.2,8.7899999999999991,140,27.9,3.53,46.2,18.5,2.0299999999999998]
[null,"100*51",5,13.7,10.75,167,33.299999999999997,3.48,54.3,21.7,1.99]
[null,"100*52",6.3,16.899999999999999,13.27,197,39.4,3.42,63,25.2,1.93]
[null,"100*60",4,12,9.42,158,31.6,3.63,70.5,23.5,2.4300000000000002]
[null,"100*61",5,14.7,11.54,189,37.799999999999997,3.58,83.6,27.9,2.38]
[null,"100*62",6.3,18.100000000000001,14.21,225,45,3.52,98.1,32.700000000000003,2.33]
[null,"120*60",4,13.6,10.68,249,41.5,4.28,83.1,27.7,2.4700000000000002]
[null,"120*61",5,16.7,13.11,299,49.9,4.2300000000000004,98.8,32.9,2.4300000000000002]
[null,"120*62",6.3,20.7,16.25,358,59.7,4.16,116,38.799999999999997,2.37]
[null,"120*80",4,15.2,11.93,303,50.4,4.46,161,40.200000000000003,3.25]
[null,"120*81",5,18.7,14.68,365,60.9,4.42,193,48.2,3.21]
[null,"120*82",6.3,23.2,18.21,440,73.3,4.3600000000000003,230,57.6,3.15]
[null,"140*80",4,16.8,13.19,441,62.9,5.12,184,46,3.31]
[null,"140*81",5,20.7,16.25,534,76.3,5.08,222,55.3,3.27]
[null,"140*82",6.3,25.7,20.170000000000002,646,92.3,5.01,265,66.2,3.21]
[null,"150*100",6.3,29.5,23.16,898,120,5.52,474,94.8,4.01]
[null,"150*101",8,36.799999999999997,28.89,1087,145,5.44,569,114,3.94]
[null,"150*102",10,44.9,35.25,1282,171,5.34,665,133,3.85]
[null,"160*80",5,22.7,17.82,744,93,5.72,249,62.3,3.31]
[null,"160*81",6.3,28.2,22.14,903,113,5.66,299,74.8,3.26]
[null,"160*82",8,35.200000000000003,27.63,1091,136,5.57,356,89,3.18]
[null,"160*83",10,42.9,33.68,1284,161,5.47,411,103,3.1]
[null,"180*100",5,26.7,20.96,1153,128,6.57,460,92,4.1500000000000004]
[null,"180*101",6.3,33.299999999999997,26.14,1407,156,6.5,557,111,4.09]
[null,"180*102",8,41.6,32.659999999999997,1713,190,6.42,671,134,4.0199999999999996]
[null,"180*103",10,50.9,39.96,2036,226,6.32,787,157,3.93]
[null,"200*100",6.3,35.799999999999997,28.1,1829,183,7.15,613,123,4.1399999999999997]
[null,"200*101",8,44.8,35.17,2234,223,7.06,739,148,4.0599999999999996]
[null,"200*102",10,54.9,43.1,2664,266,6.96,869,174,3.98]
[null,"200*103",12.5,67.099999999999994,52.67,3136,314,6.84,1004,201,3.87]
[null,"200*120",6.3,38.299999999999997,30.07,2065,207,7.34,929,155,4.92]
[null,"200*121",8,48,37.68,2529,253,7.26,1128,188,4.8499999999999996]
[null,"200*122",10,58.9,46.24,3026,303,7.17,1337,223,4.76]
[null,"200*123",12.5,72.099999999999994,56.6,3576,358,7.04,1562,160,4.66]
[null,"250*150",6.3,48.4,37.99,4143,331,9.25,1874,250,6.22]
[null,"250*151",8,60.8,47.73,5111,409,9.17,2298,306,6.15]
[null,"250*152",10,74.900000000000006,58.8,6174,494,9.08,2755,367,6.06]
[null,"250*153",12.5,92.1,72.3,7378,591,8.9600000000000009,3265,435,5.96]
[null,"260*180",6.3,53.4,41.92,5166,397,9.83,2929,325,7.4]
[null,"260*181",8,67.2,52.75,6390,492,9.75,3608,401,7.33]
[null,"260*182",10,82.9,65.08,7741,595,9.66,4351,483,7.24]
[null,"260*183",12.5,102,80.069999999999993,9299,715,9.5399999999999991,5196,577,7.13]
[null,"300*200",6.3,61,47.89,7829,522,11.3,4193,419,8.2899999999999991]
[null,"300*201",8,76.8,60.29,9717,648,11.3,5184,518,8.2200000000000006]
[null,"300*202",10,94.9,74.5,11819,788,11.2,6278,628,8.1300000000000008]
[null,"300*203",12.5,117,91.85,14273,952,11,7537,754,8.02]
[null,"350*250",8,92.8,72.849999999999994,16449,940,13.3,9798,784,10.3]
[null,"350*251",10,115,90.28,20102,1149,13.2,11937,955,10.199999999999999]
[null,"350*252",12.5,142,111.47,24419,1395,13.1,14444,1156,10.1]
[null,"350*253",16,179,140.52000000000001,30011,1715,12.9,17654,1412,9.93]
[null,"400*200",8,92.8,72.849999999999994,19562,978,14.5,6660,666,8.4700000000000006]
[null,"400*201",10,115,90.28,23914,1196,14.4,8084,808,8.39]
[null,"400*202",12.5,142,111.47,29063,1453,14.3,9738,974,8.2799999999999994]
[null,"400*203",16,179,140.52000000000001,35738,1787,14.1,11824,1182,8.1300000000000008]
[null,"450*250",8,109,85.57,30082,1337,16.600000000000001,12142,971,10.6]
[null,"450*251",10,135,105.98,36895,1640,16.5,14819,1185,10.5]
[null,"450*252",12.5,167,131.1,45026,2001,16.399999999999999,17973,1438,10.4]
[null,"450*253",16,211,165.64,55705,2476,16.2,22041,1763,10.199999999999999]
[null,"500*300",10,155,121.68,53762,2150,18.600000000000001,24439,1629,12.6]
[null,"500*301",12.5,192,150.72,65813,2633,18.5,29780,1985,12.5]
[null,"500*302",16,243,190.76,81783,3271,18.3,36768,2451,12.3]
[null,"500*303",20,300,235.5,98777,3951,18.2,44078,2939,12.1]
[]
["تــــــــــوليـــــــــــــــــــد.ســـــــــــــــــــــــــرد","40*20",2,2.14,1.68,4.05,2.02,1.38,1.34,1.34,0.79]
[null,"40*21",2.5,2.59,2.0299999999999998,4.6900000000000004,2.35,1.35,1.54,1.54,0.77]
[null,"50*28",2,2.94,2.31,9.5399999999999991,3.81,1.8,4.29,2.86,1.21]
[null,"50*29",3,4.21,3.3,12.8,5.13,1.74,5.7,3.8,1.1599999999999999]
[null,"50*30",4,5.35,4.2,15.3,6.1,1.69,6.69,4.46,1.1200000000000001]
[null,"60*40",2,3.47,2.72,18.399999999999999,6.14,2.2999999999999998,9.83,4.92,1.68]
[null,"60*41",3,5.41,4.25,25.4,8.4600000000000009,2.17,13.4,6.72,1.57]
[null,"60*42",4,6.95,5.46,31,10.3,2.11,16.3,8.14,1.53]
[null,"60*43",5,8.36,6.56,35.299999999999997,11.8,2.0499999999999998,18.399999999999999,9.2100000000000009,1.48]
[null,"80*40",2,4.54,3.56,37.4,9.34,2.87,12.7,6.36,1.67]
[null,"80*41",3,6.61,5.19,52.3,13.1,2.81,17.600000000000001,8.7799999999999994,1.63]
[null,"80*42",4,8.5500000000000007,6.71,64.8,16.2,2.75,21.5,10.7,1.59]
[null,"80*43",5,10.4,8.16,75.099999999999994,18.8,2.69,24.6,12.3,1.54]
[null,"90*50",3,7.81,6.13,81.900000000000006,18.2,3.24,32.700000000000003,13.1,2.0499999999999998]
[null,"90*51",4,10.1,7.93,103,22.8,3.19,40.700000000000003,16.3,2.0099999999999998]
[null,"90*52",5,12.4,9.73,121,26.8,3.12,47.4,18.899999999999999,1.96]
[null,"100*50",3,8.41,6.6,106,21.3,3.55,36.1,14.4,2.0699999999999998]
[null,"100*51",5,13.4,10.52,158,31.6,3.43,52.5,21,1.98]
[null,"100*60",3,9.01,7.07,121,24.1,3.66,54.6,18.2,2.46]
[null,"100*61",4,11.7,9.18,153,30.5,3.62,68.7,22.9,2.42]
[null,"100*62",5,14.4,11.3,181,36.200000000000003,3.55,80.8,26.9,2.37]
[null,"100*63",6.3,17.2,13.5,203,40.700000000000003,3.44,90.9,30.3,2.2999999999999998]
[null,"120*60",3,10.199999999999999,8.01,189,31.5,4.3,64.400000000000006,21.5,2.5099999999999998]
[null,"120*61",4,13.3,10.44,241,40.1,4.26,81.2,27.1,2.4700000000000002]
[null,"120*62",5,16.399999999999999,12.87,287,47.8,4.18,96,32,2.42]
[null,"120*63",6.3,19.7,15.46,327,54.5,4.07,109,36.4,2.35]
[null,"120*80",4,14.9,11.7,295,49.1,4.45,157,39.299999999999997,3.25]
[null,"120*81",5,18.399999999999999,14.44,353,58.9,4.38,188,46.8,3.2]
[null,"120*82",6.3,22.2,17.43,408,68.099999999999994,4.29,217,54.3,3.13]
[null,"140*80",4,16.5,12.95,430,61.4,5.0999999999999996,180,45.1,3.3]
[null,"140*81",5,20.399999999999999,16.010000000000002,517,73.900000000000006,5.03,216,54,3.25]
[null,"140*82",6.3,24.8,19.47,603,86.1,4.93,251,62.9,3.18]
[null,"150*100",4,18.899999999999999,14.84,595,79.3,5.61,319,63.7,4.1100000000000003]
[null,"150*101",5,23.4,18.37,719,95.9,5.54,384,76.8,4.05]
[null,"150*102",6.3,28.5,22.37,848,113,5.45,453,90.5,3.99]
[null,"150*103",8,35.200000000000003,27.63,1008,134,5.35,536,107,3.9]
[null,"160*80",4,18.100000000000001,14.21,598,74.7,5.75,204,50.9,3.36]
[null,"160*81",5,22.4,17.579999999999998,722,90.2,5.68,244,61,3.3]
[null,"160*82",6.3,27.3,21.43,846,106,5.57,286,71.400000000000006,3.24]
[null,"160*83",8,33.6,26.38,1001,125,5.46,335,83.7,3.16]
[null,"180*100",5,26.4,20.72,1124,125,6.53,452,90.4,4.1399999999999997]
[null,"180*101",6.3,32.299999999999997,25.36,1335,148,6.43,536,107,4.07]
[null,"180*102",8,40,31.4,1598,178,6.32,637,127,3.99]
[null,"180*103",10,48.6,38.15,1859,207,6.18,736,147,3.89]
[null,"200*100",6.3,34.799999999999997,27.32,1739,174,7.07,591,118,4.12]
[null,"200*101",8,43.2,33.909999999999997,2091,209,6.96,705,141,4.04]
[null,"200*102",10,52.6,41.29,2444,244,6.82,818,164,3.94]
[null,"200*120",5,30.4,23.86,1649,165,7.37,750,125,4.97]
[null,"200*121",6.3,37.4,29.36,1976,198,7.27,898,150,4.9000000000000004]
[null,"200*122",8,46.4,36.42,2386,239,7.17,1079,180,4.82]
[null,"200*123",10,56.6,44.43,2806,281,7.04,1262,210,4.72]
[null,"250*150",6.3,47.4,37.21,4001,320,9.19,1825,243,6.21]
[null,"250*151",8,59.2,46.47,4886,391,9.08,2219,286,6.12]
[null,"250*152",10,72.599999999999994,56.99,5825,466,8.9600000000000009,2634,351,6.02]
[null,"250*153",12.5,87,68.3,6633,531,8.73,3002,400,5.87]
[null,"300*100",6.3,47.4,37.21,4907,327,10.17,868,174,4.28]
[null,"300*101",10,72.599999999999994,56.99,7106,474,9.89,1224,245,4.1100000000000003]
[null,"300*102",12.5,84.1,66.02,7808,521,9.64,1343,269,4]
[null,"300*200",6.3,60,47.1,7624,508,11.27,4104,410,8.27]
[null,"300*201",8,75.2,59.03,9389,626,11.17,5142,504,8.27]
[null,"300*202",10,92.6,72.69,11313,754,11.05,6058,606,8.09]
[null,"300*203",12.5,112,87.92,13179,879,10.85,7066,706,7.94]
[null,"350*250",6.3,72.599999999999994,56.99,12923,738,13.34,7744,620,10.33]
[null,"350*251",8,91.2,71.59,16001,914,13.25,9573,766,10.25]
[null,"350*252",10,113,88.71,19407,1109,13.11,11588,927,10.130000000000001]
[null,"350*253",12,132,103.62,22197,1268,12.97,13261,1061,10.02]
[null,"400*200",8,91.2,71.59,18974,949,14.42,6517,652,8.4499999999999993]
[null,"400*201",10,113,88.71,23003,1150,14.27,7864,786,8.34]
[null,"400*202",12.5,137,107.55,27100,1355,14.06,9260,926,8.2200000000000006]
[null,"400*300",8,107,84,25122,1256,15.32,16212,1081,12.31]
[null,"400*301",10,133,104.41,30609,1530,15.17,19726,1315,12.18]
[null,"400*302",12,156,122.46,35284,1764,15.04,22747,1516,12.08]

{"sheet":"قوطي_دايره","index":8,"n_rows":147,"n_cols":19,"rows_kept":147,"cut":false,"hidden":false,"merged":[]}
[]
[null,"D","T","A","M","I","W","i"]
[null,"mm","mm","cm²","kg/m","cm⁴","cm³","cm"]
[null,33.700000000000003,2.6,null,null,null,null,null,{"$f":"ROUND(((PI()*POWER(B4/10,2))/2)-((PI()*POWER((B4-C4)/10,2))/2),2)","v":2.65},2.54,{"$f":"I4-J4","v":0.10999999999999988},{"$f":"ROUND((PI()/2)*(ROUND(POWER(B4,1.991),0)-ROUND(POWER(B4-C4,1.991),0))/100,2)","v":2.54},{"$f":"J4-L4","v":0},{"$f":"((PI()*POWER(B4/10,2))/2)-((PI()*POWER((B4-C4)/10,2))/2)","v":2.6464776513840391},null,null,{"$f":"PI()*POWER(AVERAGE(B4,B4-C4)/20,3)","v":13.356569131331312},{"$f":"(PI()/64)*(POWER(B4,4)-POWER(B4-C4,4))","v":17391.493290923467},{"$f":"R4*2/10000","v":3.4782986581846935}]
[null,33.700000000000003,3.2,null,null,null,null,null,{"$f":"ROUND(((PI()*POWER(B5/10,2))/2)-((PI()*POWER((B5-C5)/10,2))/2),2)","v":3.23},3.07,{"$f":"I5-J5","v":0.16000000000000014},{"$f":"ROUND((3/2)*(ROUND(POWER(B5,2),0)-ROUND(POWER(B5-C5,2),0))/100,2)","v":3.09},{"$f":"J5-L5","v":-2.0000000000000018E-2},{"$f":"((PI()*POWER(B5/10,2))/2)-((PI()*POWER((B5-C5)/10,2))/2)","v":3.227043973767433},null,null,{"$f":"PI()*POWER(AVERAGE(B5,B5-C5)/20,3)","v":12.988978050819153},{"$f":"(PI()/64)*(POWER(B5,4)-POWER(B5-C5,4))","v":20833.997584890931},4.1667995169781857]
[null,33.700000000000003,4,null,null,null,null,null,3.98,3.73,0.25,3.81,-8.0000000000000071E-2,{"$f":"((PI()*POWER(B6/10,2))/2)-((PI()*POWER((B6-C6)/10,2))/2)","v":3.983539484751855},null,null,{"$f":"PI()*POWER(AVERAGE(B6,B6-C6)/20,3)","v":12.509434352600923},{"$f":"(PI()/64)*(POWER(B6,4)-POWER(B6-C6,4))","v":25118.457192320653},5.0236914384641302]
[null,42.4,2.6,null,null,null,null,null,3.36,3.25,0.10999999999999988,3.21,4.0000000000000036E-2,{"$f":"((PI()*POWER(B7/10,2))/2)-((PI()*POWER((B7-C7)/10,2))/2)","v":3.3571059096260605},null,null,{"$f":"PI()*POWER(AVERAGE(B7,B7-C7)/20,3)","v":27.263734969227993},{"$f":"(PI()/64)*(POWER(B7,4)-POWER(B7-C7,4))","v":35478.314891166861},7.0956629782333724]
[null,42.4,3.2,null,null,null,null,null,{"$f":"ROUND(((PI()*POWER(B8/10,2))/2)-((PI()*POWER((B8-C8)/10,2))/2),2)","v":4.0999999999999996},3.94,0.1599999999999997,3.92,2.0000000000000018E-2,null,null,null,null,{"$f":"(PI()/64)*(POWER(B8,4)-POWER(B8-C8,4))","v":42739.332300049653},8.5478664600099314]
[null,42.4,4,null,null,null,null,null,5.08,4.83,0.25,4.8499999999999996,-1.9999999999999574E-2,null,null,null,null,null,0]
[null,48.3,2.6,null,null,null,null,null,3.84,3.73,0.10999999999999988,3.68,4.9999999999999822E-2]
[null,48.3,3.2,null,null,null,null,null,4.6900000000000004,4.53,0.16000000000000014,4.49,4.0000000000000036E-2]
[null,48.3,4,null,null,null,null,null,5.82,5.57,0.25,5.57,0]
[null,60.3,3.2,null,null,null,null,null,5.9,5.74,0.16000000000000014,5.64,0.10000000000000053]
[null,60.3,4,null,null,null,null,null,7.33,7.07,0.25999999999999979,6.99,8.0000000000000071E-2]
[null,60.3,5,null,null,null,null,null,9.08,8.69,0.39000000000000057,8.67,1.9999999999999574E-2]
[null,76.099999999999994,3.2,null,null,null,null,null,7.49,7.33,0.16000000000000014,{"$f":"ROUND((3/2)*(POWER(B16,2)-POWER(B16-C16,2))/100,2)","v":7.15},0.17999999999999972,{"$f":"ROUND((3/2)*(POWER(D16,2)-POWER(D16-E16,2))/100,2)","v":0}]
[null,76.099999999999994,4,null,null,null,null,null,9.31,null,9.31,8.9,-8.9]
[null,76.099999999999994,5,null,null,null,null,null,11.56,11.2,0.36000000000000121,11.04,0.16000000000000014]
[null,88.9,3.2,null,null,null,null,null,8.7799999999999994,null,8.7799999999999994,8.39,-8.39]
[null,88.9,4,null,null,null,null,null,10.92,null,10.92,10.43,-10.43]
[null,88.9,5,null,null,null,null,null,13.57,null,13.57,12.96,-12.96]
[null,88.9,6,null,null,null,null,null,{"$f":"ROUND(((PI()*POWER(B22/10,2))/2)-((PI()*POWER((B22-C22)/10,2))/2),2)","v":16.190000000000001},15.6,0.59000000000000163,15.47,0.12999999999999901]
[null,88.9,6.3,null,null,null,null,null,16.97,16.3,0.66999999999999815,16.2,0.10000000000000142]
[null,101.6,4,null,null,null,null,null,12.52,null,12.52,11.96,-11.96]
[null,101.6,5,null,null,null,null,null,15.57,null,15.57,14.87,-14.87]
[null,101.6,6.3,null,null,null,null,null,{"$f":"ROUND(((PI()*POWER(B26/10,2))/2)-((PI()*POWER((B26-C26)/10,2))/2),2)","v":19.489999999999998},18.899999999999999,0.58999999999999986,18.62,0.27999999999999758]
[null,114.3,4,null,null,null,null,null,14.11,null,14.11,13.47,-13.47]
[null,114.3,5,null,null,null,null,null,17.559999999999999,null,17.559999999999999,16.77,-16.77]
[null,114.3,6.3,null,null,null,null,null,22,21.4,0.60000000000000142,21,0.39999999999999858]
[null,114.3,8,null,null,null,null,null,27.72,null,27.72,26.46,-26.46]
[null,139.69999999999999,4,null,null,null,null,null,17.3,null,17.3,16.53,-16.53]
[null,139.69999999999999,5,null,null,null,null,null,21.55,null,21.55,20.58,-20.58]
[null,139.69999999999999,6.3,null,null,null,null,null,{"$f":"ROUND(((PI()*POWER(B33/10,2))/2)-((PI()*POWER((B33-C33)/10,2))/2),2)","v":27.03},26.4,0.63000000000000256,25.8,0.59999999999999787]
[null,139.69999999999999,8,null,null,null,null,null,34.11,26,8.11,32.57,-6.57]
[null,139.69999999999999,12.5,null,null,null,null,null,52.41,null,52.41,50.04,-50.04]
[null,168.3,5,null,null,null,null,null,26.04,null,26.04,24.87,-24.87]
[null,168.3,6.3,null,null,null,null,null,{"$f":"ROUND(((PI()*POWER(B37/10,2))/2)-((PI()*POWER((B37-C37)/10,2))/2),2)","v":32.69},null,32.69,31.22,-31.22]
[null,168.3,8,null,null,null,null,null,41.29,40.299999999999997,0.99000000000000199,39.44,0.85999999999999943]
[null,168.3,10,null,null,null,null,null,51.3,null,51.3,48.99,-48.99]
[null,168.3,12.5,null,null,null,null,null,63.64,null,63.64,60.77,-60.77]
[null,177.8,6.3,null,null,null,null,null,34.57,null,34.57,33.020000000000003,-33.020000000000003]
[null,177.8,8,null,null,null,null,null,43.68,null,43.68,41.72,-41.72]
[null,177.8,10,null,null,null,null,null,54.29,null,54.29,51.84,-51.84]
[null,177.8,12.5,null,null,null,null,null,67.37,null,67.37,64.34,-64.34]
[null,193.7,6.3,null,null,null,null,null,37.71,null,37.71,36.020000000000003,-36.020000000000003]
[null,193.7,8,null,null,null,null,null,{"$f":"ROUND(((PI()*POWER(B46/10,2))/2)-((PI()*POWER((B46-C46)/10,2))/2),2)","v":47.68},null,47.68,45.54,-45.54]
[null,193.7,10,null,null,null,null,null,59.28,null,59.28,56.61,-56.61]
[null,193.7,16,null,null,null,null,null,93.34,null,93.34,89.15,-89.15]
[null,219.1,6.3,null,null,null,null,null,42.74,null,42.74,40.82,-40.82]
[null,219.1,8,null,null,null,null,null,{"$f":"ROUND(((PI()*POWER(B50/10,2))/2)-((PI()*POWER((B50-C50)/10,2))/2),2)","v":54.06},null,54.06,51.63,-51.63]
[null,219.1,10,null,null,null,null,null,67.260000000000005,null,67.260000000000005,64.23,-64.23]
[null,219.1,16,null,null,null,null,null,106.11,null,106.11,101.33,-101.33]
[null,219.1,20,null,null,null,null,null,131.38,null,131.38,125.46,-125.46]
[null,244.5,6.3,null,null,null,null,null,47.77,null,47.77,45.62,-45.62]
[null,244.5,8,null,null,null,null,null,60.44,null,60.44,57.72,-57.72]
[null,244.5,10,null,null,null,null,null,{"$f":"ROUND(((PI()*POWER(B56/10,2))/2)-((PI()*POWER((B56-C56)/10,2))/2),2)","v":75.239999999999995},null,75.239999999999995,71.849999999999994,-71.849999999999994]
[null,244.5,12.5,null,null,null,null,null,93.56,null,93.56,89.34,-89.34]
[null,244.5,16,null,null,null,null,null,118.88,null,118.88,113.52,-113.52]
[null,244.5,20,null,null,null,null,null,147.34,null,147.34,140.69999999999999,-140.69999999999999]
[null,244.5,25,null,null,null,null,null,{"$f":"ROUND(((PI()*POWER(B60/10,2))/2)-((PI()*POWER((B60-C60)/10,2))/2),2)","v":182.21},null,182.21,174,-174]
[null,273,6.3,null,null,null,null,null,53.41,null,53.41,51,-51]
[null,273,8,null,null,null,null,null,67.61,null,67.61,64.56,-64.56]
[null,273,10,null,null,null,null,null,84.19,null,84.19,80.400000000000006,-80.400000000000006]
[null,273,12.5,null,null,null,null,null,104.75,null,104.75,100.04,-100.04]
[null,273,16,null,null,null,null,null,133.19999999999999,null,133.19999999999999,127.2,-127.2]
[null,273,20,null,null,null,null,null,165.25,null,165.25,157.80000000000001,-157.80000000000001]
[null,273,25,null,null,null,null,null,204.6,null,204.6,195.38,-195.38]
[null,323.89999999999998,8,null,null,null,null,null,80.400000000000006,null,80.400000000000006,76.77,-76.77]
[null,323.89999999999998,10,null,null,null,null,null,{"$f":"ROUND(((PI()*POWER(B69/10,2))/2)-((PI()*POWER((B69-C69)/10,2))/2),2)","v":100.19},null,{"$f":"I69-J69","v":100.19},{"$f":"ROUND((3/2)*(ROUND(POWER(B69,2),0)-ROUND(POWER(B69-C69,2),0))/100,2)","v":95.67},{"$f":"J69-L69","v":-95.67}]
[null,323.89999999999998,12.5,null,null,null,null,null,{"$f":"ROUND(((PI()*POWER(B70/10,2))/2)-((PI()*POWER((B70-C70)/10,2))/2),2)","v":124.74},null,124.74,119.12,-119.12]
[null,323.89999999999998,16,null,null,null,null,null,{"$f":"ROUND(((PI()*POWER(B71/10,2))/2)-((PI()*POWER((B71-C71)/10,2))/2),2)","v":158.79},null,158.79,151.63999999999999,-151.63999999999999]
[null,323.89999999999998,20,null,null,null,null,null,{"$f":"ROUND(((PI()*POWER(B72/10,2))/2)-((PI()*POWER((B72-C72)/10,2))/2),2)","v":197.23},null,197.23,188.34,-188.34]
[null,323.89999999999998,25,null,null,null,null,null,{"$f":"ROUND(((PI()*POWER(B73/10,2))/2)-((PI()*POWER((B73-C73)/10,2))/2),2)","v":244.57},null,244.57,233.55,-233.55]
[null,355.6,8,null,null,null,null,null,{"$f":"ROUND(((PI()*POWER(B74/10,2))/2)-((PI()*POWER((B74-C74)/10,2))/2),2)","v":88.37},null,88.37,84.38,-84.38]
[null,355.6,10,null,null,null,null,null,110.14,null,110.14,105.18,-105.18]
[null,355.6,12.5,null,null,null,null,null,137.19,null,137.19,131,-131]
[null,355.6,16,null,null,null,null,null,174.72,null,174.72,166.85,-166.85]
[null,355.6,20,null,null,null,null,null,217.15,null,217.15,207.36,-207.36]
[null,355.6,25,null,null,null,null,null,269.47000000000003,null,269.47000000000003,257.33,-257.33]
[null,406.4,10,null,null,null,null,null,126.1,null,126.1,120.42,-120.42]
[null,406.4,12.5,null,null,null,null,null,157.13999999999999,null,157.13999999999999,150.06,-150.06]
[null,406.4,16,null,null,null,null,null,200.26,null,200.26,191.24,-191.24]
[null,406.4,20,null,null,null,null,null,249.07,null,249.07,237.84,-237.84]
[null,406.4,25,null,null,null,null,null,309.37,null,309.37,295.43,-295.43]
[null,406.4,30,null,null,null,null,null,368.89,null,368.89,352.26,-352.26]
[null,406.4,40,null,null,null,null,null,485.56,null,485.56,463.68,-463.68]
[null,457,10,null,null,null,null,null,142,null,142,135.6,-135.6]
[null,457,12.5,null,null,null,null,null,177.01,null,177.01,169.04,-169.04]
[null,457,16,null,null,null,null,null,225.69,null,225.69,215.52,-215.52]
[null,457,20,null,null,null,null,null,280.86,null,280.86,268.2,-268.2]
[null,457,25,null,null,null,null,null,349.11,null,349.11,333.38,-333.38]
[null,457,30,null,null,null,null,null,416.58,null,416.58,397.8,-397.8]
[null,457,40,null,null,null,null,null,549.15,null,549.15,524.4,-524.4]
[null,457,50,null,null,null,null,null,678.58,null,678.58,648,-648]
[null,508,10,null,null,null,null,null,158.02000000000001,null,158.02000000000001,150.9,-150.9]
[null,508,12.5,null,null,null,null,null,197.04,null,197.04,188.16,-188.16]
[null,508,16,null,null,null,null,null,251.33,null,251.33,240,-240]
[null,508,20,null,null,null,null,null,312.89999999999998,null,312.89999999999998,298.8,-298.8]
[null,508,25,null,null,null,null,null,389.16,null,389.16,371.63,-371.63]
[null,508,30,null,null,null,null,null,464.64,null,464.64,443.7,-443.7]
[null,508,40,null,null,null,null,null,613.24,null,613.24,585.6,-585.6]
[null,508,50,null,null,null,null,null,758.69,null,758.69,724.5,-724.5]
[null,610,10,null,null,null,null,null,190.07,null,190.07,181.5,-181.5]
[null,610,12.5,null,null,null,null,null,237.09,null,237.09,226.41,-226.41]
[null,610,16,null,null,null,null,null,302.60000000000002,null,302.60000000000002,288.95999999999998,-288.95999999999998]
[null,610,20,null,null,null,null,null,376.99,null,376.99,360,-360]
[null,610,25,null,null,null,null,null,469.28,null,469.28,448.13,-448.13]
[null,610,30,null,null,null,null,null,560.77,null,560.77,535.5,-535.5]
[null,610,40,null,null,null,null,null,741.42,null,741.42,708,-708]
[null,610,50,null,null,null,null,null,918.92,null,918.92,877.5,-877.5]
[null,711,10,null,null,null,null,null,221.8,null,221.8,211.8,-211.8]
[null,711,20,null,null,null,null,null,440.45,null,440.45,420.6,-420.6]
[null,711,25,null,null,null,null,null,548.6,null,548.6,523.88,-523.88]
[null,711,30,null,null,null,null,null,655.96,null,655.96,626.4,-626.4]
[null,711,40,null,null,null,null,null,868.34,null,868.34,829.2,-829.2]
[null,711,50,null,null,null,null,null,1077.57,null,1077.57,1029,-1029]
[null,711,60,null,null,null,null,null,1283.6500000000001,null,1283.6500000000001,1225.8,-1225.8]
[null,762,10,null,null,null,null,null,237.82,null,237.82,227.1,-227.1]
[null,762,16,null,null,null,null,null,379,null,379,361.92,-361.92]
[null,762,20,null,null,null,null,null,472.5,null,472.5,451.2,-451.2]
[null,762,25,null,null,null,null,null,588.66,null,588.66,562.13,-562.13]
[null,762,30,null,null,null,null,null,704.03,null,704.03,672.3,-672.3]
[null,762,40,null,null,null,null,null,932.42,null,932.42,890.4,-890.4]
[null,762,50,null,null,null,null,null,1157.68,null,1157.68,1105.5,-1105.5]
[null,813,10,null,null,null,null,null,253.84,null,253.84,242.4,-242.4]
[null,813,16,null,null,null,null,null,404.64,null,404.64,386.4,-386.4]
[null,813,20,null,null,null,null,null,504.54,null,504.54,481.8,-481.8]
[null,813,25,null,null,null,null,null,628.71,null,628.71,600.38,-600.38]
[null,813,30,null,null,null,null,null,752.1,null,752.1,718.2,-718.2]
[null,914,10,null,null,null,null,null,285.57,null,285.57,272.7,-272.7]
[null,914,16,null,null,null,null,null,455.41,null,455.41,434.88,-434.88]
[null,914,25,null,null,null,null,null,708.04,null,708.04,676.13,-676.13]
[null,914,30,null,null,null,null,null,847.29,null,{"$f":"I133-J133","v":847.29},{"$f":"ROUND((3/2)*(ROUND(POWER(B133,2),0)-ROUND(POWER(B133-C133,2),0))/100,2)","v":809.1},{"$f":"J133-L133","v":-809.1}]
[null,1016,10,null,null,null,null,null,317.62,null,317.62,303.3,-303.3]
[null,1016,16,null,null,null,null,null,506.68,null,506.68,483.84,-483.84]
[null,1016,25,null,null,null,null,null,788.15,null,788.15,752.63,-752.63]
[null,1016,30,null,null,null,null,null,943.42,null,943.42,900.9,-900.9]
[null,1067,10,null,null,null,null,null,{"$f":"ROUND(((PI()*POWER(B138/10,2))/2)-((PI()*POWER((B138-C138)/10,2))/2),2)","v":333.64},null,333.64,318.60000000000002,-318.60000000000002]
[null,1067,16,null,null,null,null,null,532.30999999999995,null,532.30999999999995,508.32,-508.32]
[null,1067,25,null,null,null,null,null,828.2,null,828.2,790.88,-790.88]
[null,1067,30,null,null,null,null,null,991.49,null,991.49,946.8,-946.8]
[null,1168,10,null,null,null,null,null,365.37,364,1.3700000000000045,{"$f":"ROUND(ROUND((PI()/2),5)*(ROUND(POWER(B142,2),0)-ROUND(POWER(B142-C142,2),0))/100,2)","v":365.37},{"$f":"J142-L142","v":-1.3700000000000045}]
[null,1168,16,null,null,null,null,null,583.08000000000004,null,583.08000000000004,{"$f":"ROUND(ROUND((PI()/2),5)*(ROUND(POWER(B143,2),0)-ROUND(POWER(B143-C143,2),0))/100,2)","v":583.08000000000004},-583.08000000000004]
[null,1168,25,null,null,null,null,null,907.53,null,907.53,866.63,-866.63]
[null,1219,10,null,null,null,null,null,381.39,380,1.3899999999999864,{"$f":"ROUND((PI()/2)*(ROUND(POWER(B4,1.991),0)-ROUND(POWER(B4-C4,1.991),0))/100,2)","v":2.54},377.46]
[null,1219,16,null,null,null,null,null,608.71,null,608.71,581.28,-581.28]
[null,1219,25,null,null,null,null,null,947.58,null,947.58,904.88,-904.88]

{"sheet":"zشكل","index":9,"n_rows":13,"n_cols":25,"rows_kept":13,"cut":false,"hidden":false,"merged":[[0,2,1,7],[0,11,0,22]]}
[null,null,null,null,null,null,null,null,null,null,null,"براي محور خمش"]
[null,null,null,null,null,null,null,null,null,null,null,"y-y","y-y","y-y","z-z","z-z","z-z","ƞ-ƞ","ƞ-ƞ","ƞ-ƞ","ζ-ζ","ζ-ζ","ζ-ζ"]
[null,null,"h","b","ts","tg","r2","c","A","G",null,"I","W","i","I","W","i","I","W","i","I","W","i","d1","w1"]
[null,null,"mm","mm","mm","mm","mm","mm","cm²","kg/m","tan a","cm⁴","cm³","cm","cm⁴","cm³","cm","cm⁴","cm³","cm","cm⁴","cm³","cm","mm","mm"]
[null,30,30,38,4,4.5,2.5,9,4.32,3.39,1.655,5.96,3.97,1.17,13.7,3.8,1.78,18.100000000000001,4.6900000000000004,2.04,1.54,1.1100000000000001,0.6,11,20]
[null,40,40,40,4.5,5,2.5,10,5.43,4.26,1.181,13.5,6.75,1.58,17.600000000000001,4.66,1.8,28,6.72,2.27,3.05,1.83,0.75,11,22]
[null,50,50,43,5,5.5,3,11,6.77,5.31,0.93899999999999995,26.3,10.5,1.97,23.8,5.88,1.88,44.9,9.76,2.57,5.23,2.76,0.88,11,25]
[null,60,60,45,5,6,3,12,7.91,6.21,0.77900000000000003,44.7,14.9,2.38,30.1,7.09,1.95,67.2,13.5,2.81,7.6,3.73,0.98,13,25]
[null,80,80,50,6,7,3.5,14,11.1,8.7100000000000009,0.58799999999999997,109,27.3,3.13,47.4,10.1,2.0699999999999998,142,24.4,3.58,14.7,6.44,1.1499999999999999,13,30]
[null,100,100,55,6.5,8,4,16,14.5,11.4,0.49199999999999999,222,44.4,3.91,72.5,14,2.2400000000000002,270,39.799999999999997,4.3099999999999996,24.6,9.26,1.3,17,30]
[null,120,120,60,7,9,4.5,18,18.2,14.3,0.433,402,67,4.7,106,18.8,2.42,470,60.6,5.08,37.700000000000003,12.5,1.44,17,35]
[null,140,140,65,8,10,5,20,22.9,18,0.38500000000000001,676,96.6,5.43,148,24.3,2.54,768,88,5.79,56.4,16.600000000000001,1.57,17,35]
[null,160,160,70,8.5,11,5.5,22,27.5,21.6,0.35699999999999998,1060,132,6.2,204,31,2.72,1180,121,6.57,79.5,21.4,1.7,17,35]