{"text_format":"1","workbook":"xlsx","n_sheets":3,"sheets":["تولید","سفارشات","مانده سفارش"],"not_rendered":{"charts":0,"images":0,"macros":1,"external_links":0,"defined_names":1,"comments":0,"pivot_tables":0},"unopened":[],"bounds":{"document_bytes":16777216,"sheet_cells":100000,"rows_first":2000,"rows_last":500,"rows_between":2000,"halvings":0,"cell_chars":16384,"cell_head_chars":4096},"cells_cut":0,"cells_raw":0,"read":"whole","date_system":"1900"}

{"sheet":"تولید","index":0,"n_rows":6,"n_cols":5,"rows_kept":6,"cut":false,"hidden":false,"merged":[]}
["ردیف","تاریخ","شماره دستور ساخت","نام محصول","مقدار تولید"]
[1,"1393/01/05","15-001","A",100]
[2,"1393/01/06","15-002","B",200]
[3,"1393/01/07","15-003","C",50]
[4,"1393/01/08","15-004","D",185]
[5,"1393/01/09","15-005","E",652]

{"sheet":"سفارشات","index":1,"n_rows":625,"n_cols":8,"rows_kept":625,"cut":false,"hidden":false,"merged":[]}
["ردیف","تاریخ","شماره دستور ساخت","نام محصول","مقدار سفارش","تولید","اختلاف","مانده"]
[1,"1393/01/02","15-001","A",100,{"$f":"SUMIFS(تولید!E:E,تولید!C:C,C2,تولید!D:D,D2)","v":100},null,{"$f":"IF(E2-F2-G2>=0,E2-F2-G2,E2-F2-(-G2))","v":0}]
[2,"1393/01/03","15-002","B",542,{"$f":"SUMIFS(تولید!E:E,تولید!C:C,C3,تولید!D:D,D3)","v":200},null,342]
[3,"1393/01/04","15-003","C",50,{"$f":"SUMIFS(تولید!E:E,تولید!C:C,C4,تولید!D:D,D4)","v":50},null,0]
[4,"1393/01/05","15-004","D",200,{"$f":"SUMIFS(تولید!E:E,تولید!C:C,C5,تولید!D:D,D5)","v":185},null,15]
[5,"1393/01/06","15-005","E",650,{"$f":"SUMIFS(تولید!E:E,تولید!C:C,C6,تولید!D:D,D6)","v":652},2,{"$f":"IF(E6-F6-G6>=0,E6-F6-G6,E6-F6-(-G6))","v":0}]
[6,"1393/01/07","15-006","F",700,{"$f":"SUMIFS(تولید!E:E,تولید!C:C,C7,تولید!D:D,D7)","v":0},null,{"$f":"IF(E7-F7-G7>=0,E7-F7-G7,E7-F7-(-G7))","v":700}]
[7,"1393/01/08","15-007","G",570,{"$f":"SUMIFS(تولید!E:E,تولید!C:C,C8,تولید!D:D,D8)","v":0},null,570]
[8,"1393/01/09","15-008","H",420,{"$f":"SUMIFS(تولید!E:E,تولید!C:C,C9,تولید!D:D,D9)","v":0},null,420]
[9,"1393/01/10","15-009","I",150,{"$f":"SUMIFS(تولید!E:E,تولید!C:C,C10,تولید!D:D,D10)","v":0},null,150]
[10,"1393/01/11","15-010","J",320,{"$f":"SUMIFS(تولید!E:E,تولید!C:C,C11,تولید!D:D,D11)","v":0},null,320]
[null,null,null,null,null,{"$f":"SUMIFS(تولید!E:E,تولید!C:C,C12,تولید!D:D,D12)","v":0},null,0]
[null,null,null,null,null,{"$f":"SUMIFS(تولید!E:E,تولید!C:C,C13,تولید!D:D,D13)","v":0},null,0]
[null,null,null,null,null,{"$f":"SUMIFS(تولید!E:E,تولید!C:C,C14,تولید!D:D,D14)","v":0},null,0]
[null,null,null,null,null,{"$f":"SUMIFS(تولید!E:E,تولید!C:C,C15,تولید!D:D,D15)","v":0},null,0]
[null,null,null,null,null,{"$f":"SUMIFS(تولید!E:E,تولید!C:C,C16,تولید!D:D,D16)","v":0},null,0]
[null,null,null,null,null,{"$f":"SUMIFS(تولید!E:E,تولید!C:C,C17,تولید!D:D,D17)","v":0},null,0]
[null,null,null,null,null,{"$f":"SUMIFS(تولید!E:E,تولید!C:C,C18,تولید!D:D,D18)","v":0},null,0]
[null,null,null,null,null,{"$f":"SUMIFS(تولید!E:E,تولید!C:C,C19,تولید!D:D,D19)","v":0},null,0]
[null,null,null,null,null,{"$f":"SUMIFS(تولید!E:E,تولید!C:C,C20,تولید!D:D,D20)","v":0},null,0]
[null,null,null,null,null,{"$f":"SUMIFS(تولید!E:E,تولید!C:C,C21,تولید!D:D,D21)","v":0},null,0]
[null,null,null,null,null,{"$f":"SUMIFS(تولید!E:E,تولید!C:C,C22,تولید!D:D,D22)","v":0},null,0]
[null,null,null,null,null,{"$f":"SUMIFS(تولید!E:E,تولید!C:C,C23,تولید!D:D,D23)","v":0},null,0]
[null,null,null,null,null,{"$f":"SUMIFS(تولید!E:E,تولید!C:C,C24,تولید!D:D,D24)","v":0},null,0]
[null,null,null,null,null,{"$f":"SUMIFS(تولید!E:E,تولید!C:C,C25,تولید!D:D,D25)","v":0},null,0]
[null,null,null,null,null,{"$f":"SUMIFS(تولید!E:E,تولید!C:C,C26,تولید!D:D,D26)","v":0},null,0]
[null,null,null,null,null,{"$f":"SUMIFS(تولید!E:E,تولید!C:C,C27,تولید!D:D,D27)","v":0},null,0]
[null,null,null,null,null,{"$f":"SUMIFS(تولید!E:E,تولید!C:C,C28,تولید!D:D,D28)","v":0},null,0]
[null,null,null,null,null,{"$f":"SUMIFS(تولید!E:E,تولید!C:C,C29,تولید!D:D,D29)","v":0},null,0]
[null,null,null,null,null,{"$f":"SUMIFS(تولید!E:E,تولید!C:C,C30,تولید!D:D,D30)","v":0},null,0]
[null,null,null,null,null,{"$f":"SUMIFS(تولید!E:E,تولید!C:C,C31,تولید!D:D,D31)","v":0},null,0]
[null,null,null,null,null,{"$f":"SUMIFS(تولید!E:E,تولید!C:C,C32,تولید!D:D,D32)","v":0},null,0]
[null,null,null,null,null,{"$f":"SUMIFS(تولید!E:E,تولید!C:C,C33,تولید!D:D,D33)","v":0},null,0]
[null,null,null,null,null,{"$f":"SUMIFS(تولید!E:E,تولید!C:C,C34,تولید!D:D,D34)","v":0},null,0]
[null,null,null,null,null,{"$f":"SUMIFS(تولید!E:E,تولید!C:C,C35,تولید!D:D,D35)","v":0},null,0]
[null,null,null,null,null,{"$f":"SUMIFS(تولید!E:E,تولید!C:C,C36,تولید!D:D,D36)","v":0},null,0]
[null,null,null,null,null,{"$f":"SUMIFS(تولید!E:E,تولید!C:C,C37,تولید!D:D,D37)","v":0},null,0]
[null,null,null,null,null,{"$f":"SUMIFS(تولید!E:E,تولید!C:C,C38,تولید!D:D,D38)","v":0},null,0]
[null,null,null,null,null,{"$f":"SUMIFS(تولید!E:E,تولید!C:C,C39,تولید!D:D,D39)","v":0},null,0]
[null,null,null,null,null,{"$f":"SUMIFS(تولید!E:E,تولید!C:C,C40,تولید!D:D,D40)","v":0},null,0]
[null,null,null,null,null,{"$f":"SUMIFS(تولید!E:E,تولید!C:C,C41,تولید!D:D,D41)","v":0},null,0]
[null,null,null,null,null,{"$f":"SUMIFS(تولید!E:E,تولید!C:C,C42,تولید!D:D,D42)","v":0},null,0]
[null,null,null,null,null,{"$f":"SUMIFS(تولید!E:E,تولید!C:C,C43,تولید!D:D,D43)","v":0},null,0]
[null,null,null,null,null,{"$f":"SUMIFS(تولید!E:E,تولید!C:C,C44,تولید!D:D,D44)","v":0},null,0]
[null,null,null,null,null,{"$f":"SUMIFS(تولید!E:E,تولید!C:C,C45,تولید!D:D,D45)","v":0},null,0]
[null,null,null,null,null,{"$f":"SUMIFS(تولید!E:E,تولید!C:C,C46,تولید!D:D,D46)","v":0},null,0]
[null,null,null,null,null,{"$f":"SUMIFS(تولید!E:E,تولید!C:C,C47,تولید!D:D,D47)","v":0},null,0]
[null,null,null,null,null,{"$f":"SUMIFS(تولید!E:E,تولید!C:C,C48,تولید!D:D,D48)","v":0},null,0]
[null,null,null,null,null,{"$f":"SUMIFS(تولید!E:E,تولید!C:C,C49,تولید!D:D,D49)","v":0},null,0]
[null,null,null,null,null,{"$f":"SUMIFS(تولید!E:E,تولید!C:C,C50,تولید!D:D,D50)","v":0},null,0]
[null,null,null,null,null,{"$f":"SUMIFS(تولید!E:E,تولید!C:C,C51,تولید!D:D,D51)","v":0},null,0]
[null,null,null,null,null,{"$f":"SUMIFS(تولید!E:E,تولید!C:C,C52,تولید!D:D,D52)","v":0},null,0]
[null,null,null,null,null,{"$f":"SUMIFS(تولید!E:E,تولید!C:C,C53,تولید!D:D,D53)","v":0},null,0]
[null,null,null,null,null,{"$f":"SUMIFS(تولید!E:E,تولید!C:C,C54,تولید!D:D,D54)","v":0},null,0]
[null,null,null,null,null,{"$f":"SUMIFS(تولید!E:E,تولید!C:C,C55,تولید!D:D,D55)","v":0},null,0]
[null,null,null,null,null,{"$f":"SUMIFS(تولید!E:E,تولید!C:C,C56,تولید!D:D,D56)","v":0},null,0]
[null,null,null,null,null,{"$f":"SUMIFS(تولید!E:E,تولید!C:C,C57,تولید!D:D,D57)","v":0},null,0]
[null,null,null,null,null,{"$f":"SUMIFS(تولید!E:E,تولید!C:C,C58,تولید!D:D,D58)","v":0},null,0]
[null,null,null,null,null,{"$f":"SUMIFS(تولید!E:E,تولید!C:C,C59,تولید!D:D,D59)","v":0},null,0]
[null,null,null,null,null,{"$f":"SUMIFS(تولید!E:E,تولید!C:C,C60,تولید!D:D,D60)","v":0},null,0]
[null,null,null,null,null,{"$f":"SUMIFS(تولید!E:E,تولید!C:C,C61,تولید!D:D,D61)","v":0},null,0]
[null,null,null,null,null,{"$f":"SUMIFS(تولید!E:E,تولید!C:C,C62,تولید!D:D,D62)","v":0},null,0]
[null,null,null,null,null,{"$f":"SUMIFS(تولید!E:E,تولید!C:C,C63,تولید!D:D,D63)","v":0},null,0]
[null,null,null,null,null,{"$f":"SUMIFS(تولید!E:E,تولید!C:C,C64,تولید!D:D,D64)","v":0},null,0]
[null,null,null,null,null,{"$f":"SUMIFS(تولید!E:E,تولید!C:C,C65,تولید!D:D,D65)","v":0},null,0]
[null,null,null,null,null,{"$f":"SUMIFS(تولید!E:E,تولید!C:C,C66,تولید!D:D,D66)","v":0},null,0]
[null,null,null,null,null,{"$f":"SUMIFS(تولید!E:E,تولید!C:C,C67,تولید!D:D,D67)","v":0},null,0]
[null,null,null,null,null,{"$f":"SUMIFS(تولید!E:E,تولید!C:C,C68,تولید!D:D,D68)","v":0},null,0]
[null,null,null,null,null,{"$f":"SUMIFS(تولید!E:E,تولید!C:C,C69,تولید!D:D,D69)","v":0},null,0]
[null,null,null,null,null,{"$f":"SUMIFS(تولید!E:E,تولید!C:C,C70,تولید!D:D,D70)","v":0},null,0]
[null,null,null,null,null,{"$f":"SUMIFS(تولید!E:E,تولید!C:C,C71,تولید!D:D,D71)","v":0},null,{"$f":"IF(E71-F71-G71>=0,E71-F71-G71,E71-F71-(-G71))","v":0}]
[null,null,null,null,null,{"$f":"SUMIFS(تولید!E:E,تولید!C:C,C72,تولید!D:D,D72)","v":0},null,0]
[null,null,null,null,null,{"$f":"SUMIFS(تولید!E:E,تولید!C:C,C73,تولید!D:D,D73)","v":0},null,0]
[null,null,null,null,null,{"$f":"SUMIFS(تولید!E:E,تولید!C:C,C74,تولید!D:D,D74)","v":0},null,0]
[null,null,null,null,null,{"$f":"SUMIFS(تولید!E:E,تولید!C:C,C75,تولید!D:D,D75)","v":0},null,0]
[null,null,null,null,null,{"$f":"SUMIFS(تولید!E:E,تولید!C:C,C76,تولید!D:D,D76)","v":0},null,0]
[null,null,null,null,null,{"$f":"SUMIFS(تولید!E:E,تولید!C:C,C77,تولید!D:D,D77)","v":0},null,0]
[null,null,null,null,null,{"$f":"SUMIFS(تولید!E:E,تولید!C:C,C78,تولید!D:D,D78)","v":0},null,0]
[null,null,null,null,null,{"$f":"SUMIFS(تولید!E:E,تولید!C:C,C79,تولید!D:D,D79)","v":0},null,0]
[null,null,null,null,null,{"$f":"SUMIFS(تولید!E:E,تولید!C:C,C80,تولید!D:D,D80)","v":0},null,0]
[null,null,null,null,null,{"$f":"SUMIFS(تولید!E:E,تولید!C:C,C81,تولید!D:D,D81)","v":0},null,0]
[null,null,null,null,null,{"$f":"SUMIFS(تولید!E:E,تولید!C:C,C82,تولید!D:D,D82)","v":0},null,0]
[null,null,null,null,null,{"$f":"SUMIFS(تولید!E:E,تولید!C:C,C83,تولید!D:D,D83)","v":0},null,0]
[null,null,null,null,null,{"$f":"SUMIFS(تولید!E:E,تولید!C:C,C84,تولید!D:D,D84)","v":0},null,0]
[null,null,null,null,null,{"$f":"SUMIFS(تولید!E:E,تولید!C:C,C85,تولید!D:D,D85)","v":0},null,0]
[null,null,null,null,null,{"$f":"SUMIFS(تولید!E:E,تولید!C:C,C86,تولید!D:D,D86)","v":0},null,0]
[null,null,null,null,null,{"$f":"SUMIFS(تولید!E:E,تولید!C:C,C87,تولید!D:D,D87)","v":0},null,0]
[null,null,null,null,null,{"$f":"SUMIFS(تولید!E:E,تولید!C:C,C88,تولید!D:D,D88)","v":0},null,0]
[null,null,null,null,null,{"$f":"SUMIFS(تولید!E:E,تولید!C:C,C89,تولید!D:D,D89)","v":0},null,0]
[null,null,null,null,null,{"$f":"SUMIFS(تولید!E:E,تولید!C:C,C90,تولید!D:D,D90)","v":0},null,0]
[null,null,null,null,null,{"$f":"SUMIFS(تولید!E:E,تولید!C:C,C91,تولید!D:D,D91)","v":0},null,0]
[null,null,null,null,null,{"$f":"SUMIFS(تولید!E:E,تولید!C:C,C92,تولید!D:D,D92)","v":0},null,0]
[null,null,null,null,null,{"$f":"SUMIFS(تولید!E:E,تولید!C:C,C93,تولید!D:D,D93)","v":0},null,0]
[null,null,null,null,null,{"$f":"SUMIFS(تولید!E:E,تولید!C:C,C94,تولید!D:D,D94)","v":0},null,0]
[null,null,null,null,null,{"$f":"SUMIFS(تولید!E:E,تولید!C:C,C95,تولید!D:D,D95)","v":0},null,0]
[null,null,null,null,null,{"$f":"SUMIFS(تولید!E:E,تولید!C:C,C96,تولید!D:D,D96)","v":0},null,0]
[null,null,null,null,null,{"$f":"SUMIFS(تولید!E:E,تولید!C:C,C97,تولید!D:D,D97)","v":0},null,0]
[null,null,null,null,null,{"$f":"SUMIFS(تولید!E:E,تولید!C:C,C98,تولید!D:D,D98)","v":0},null,0]
[null,null,null,null,null,{"$f":"SUMIFS(تولید!E:E,تولید!C:C,C99,تولید!D:D,D99)","v":0},null,0]
[null,null,null,null,null,{"$f":"SUMIFS(تولید!E:E,تولید!C:C,C100,تولید!D:D,D100)","v":0},null,0]
[null,null,null,null,null,{"$f":"SUMIFS(تولید!E:E,تولید!C:C,C101,تولید!D:D,D101)","v":0},null,0]
[null,null,null,null,null,{"$f":"SUMIFS(تولید!E:E,تولید!C:C,C102,تولید!D:D,D102)","v":0},null,0]
[null,null,null,null,null,{"$f":"SUMIFS(تولید!E:E,تولید!C:C,C103,تولید!D:D,D103)","v":0},null,0]
[null,null,null,null,null,{"$f":"SUMIFS(تولید!E:E,تولید!C:C,C104,تولید!D:D,D104)","v":0},null,0]
[null,null,null,null,null,{"$f":"SUMIFS(تولید!E:E,تولید!C:C,C105,تولید!D:D,D105)","v":0},null,0]
[null,null,null,null,null,{"$f":"SUMIFS(تولید!E:E,تولید!C:C,C106,تولید!D:D,D106)","v":0},null,0]
[null,null,null,null,null,{"$f":"SUMIFS(تولید!E:E,تولید!C:C,C107,تولید!D:D,D107)","v":0},null,0]
[null,null,null,null,null,{"$f":"SUMIFS(تولید!E:E,تولید!C:C,C108,تولید!D:D,D108)","v":0},null,0]
[null,null,null,null,null,{"$f":"SUMIFS(تولید!E:E,تولید!C:C,C109,تولید!D:D,D109)","v":0},null,0]
[null,null,null,null,null,{"$f":"SUMIFS(تولید!E:E,تولید!C:C,C110,تولید!D:D,D110)","v":0},null,0]
[null,null,null,null,null,{"$f":"SUMIFS(تولید!E:E,تولید!C:C,C111,تولید!D:D,D111)","v":0},null,0]
[null,null,null,null,null,{"$f":"SUMIFS(تولید!E:E,تولید!C:C,C112,تولید!D:D,D112)","v":0},null,0]
[null,null,null,null,null,{"$f":"SUMIFS(تولید!E:E,تولید!C:C,C113,تولید!D:D,D113)","v":0},null,0]
[null,null,null,null,null,{"$f":"SUMIFS(تولید!E:E,تولید!C:C,C114,تولید!D:D,D114)","v":0},null,0]
[null,null,null,null,null,{"$f":"SUMIFS(تولید!E:E,تولید!C:C,C115,تولید!D:D,D115)","v":0},null,0]
[null,null,null,null,null,{"$f":"SUMIFS(تولید!E:E,تولید!C:C,C116,تولید!D:D,D116)","v":0},null,0]
[null,null,null,null,null,{"$f":"SUMIFS(تولید!E:E,تولید!C:C,C117,تولید!D:D,D117)","v":0},null,0]
[null,null,null,null,null,{"$f":"SUMIFS(تولید!E:E,تولید!C:C,C118,تولید!D:D,D118)","v":0},null,0]
[null,null,null,null,null,{"$f":"SUMIFS(تولید!E:E,تولید!C:C,C119,تولید!D:D,D119)","v":0},null,0]
[null,null,null,null,null,{"$f":"SUMIFS(تولید!E:E,تولید!C:C,C120,تولید!D:D,D120)","v":0},null,0]
[null,null,null,null,null,{"$f":"SUMIFS(تولید!E:E,تولید!C:C,C121,تولید!D:D,D121)","v":0},null,0]
[null,null,null,null,null,{"$f":"SUMIFS(تولید!E:E,تولید!C:C,C122,تولید!D:D,D122)","v":0},null,0]
[null,null,null,null,null,{"$f":"SUMIFS(تولید!E:E,تولید!C:C,C123,تولید!D:D,D123)","v":0},null,0]
[null,null,null,null,null,{"$f":"SUMIFS(تولید!E:E,تولید!C:C,C124,تولید!D:D,D124)","v":0},null,0]
[null,null,null,null,null,{"$f":"SUMIFS(تولید!E:E,تولید!C:C,C125,تولید!D:D,D125)","v":0},null,0]
[null,null,null,null,null,{"$f":"SUMIFS(تولید!E:E,تولید!C:C,C126,تولید!D:D,D126)","v":0},null,0]
[null,null,null,null,null,{"$f":"SUMIFS(تولید!E:E,تولید!C:C,C127,تولید!D:D,D127)","v":0},null,0]
[null,null,null,null,null,{"$f":"SUMIFS(تولید!E:E,تولید!C:C,C128,تولید!D:D,D128)","v":0},null,0]
[null,null,null,null,null,{"$f":"SUMIFS(تولید!E:E,تولید!C:C,C129,تولید!D:D,D129)","v":0},null,0]
[null,null,null,null,null,{"$f":"SUMIFS(تولید!E:E,تولید!C:C,C130,تولید!D:D,D130)","v":0},null,0]
[null,null,null,null,null,{"$f":"SUMIFS(تولید!E:E,تولید!C:C,C131,تولید!D:D,D131)","v":0},null,0]
[null,null,null,null,null,{"$f":"SUMIFS(تولید!E:E,تولید!C:C,C132,تولید!D:D,D132)","v":0},null,0]
[null,null,null,null,null,{"$f":"SUMIFS(تولید!E:E,تولید!C:C,C133,تولید!D:D,D133)","v":0},null,0]
[null,null,null,null,null,{"$f":"SUMIFS(تولید!E:E,تولید!C:C,C134,تولید!D:D,D134)","v":0},null,0]
[null,null,null,null,null,{"$f":"SUMIFS(تولید!E:E,تولید!C:C,C135,تولید!D:D,D135)","v":0},null,{"$f":"IF(E135-F135-G135>=0,E135-F135-G135,E135-F135-(-G135))","v":0}]
[null,null,null,null,null,{"$f":"SUMIFS(تولید!E:E,تولید!C:C,C136,تولید!D:D,D136)","v":0},null,0]
[null,null,null,null,null,{"$f":"SUMIFS(تولید!E:E,تولید!C:C,C137,تولید!D:D,D137)","v":0},null,0]
[null,null,null,null,null,{"$f":"SUMIFS(تولید!E:E,تولید!C:C,C138,تولید!D:D,D138)","v":0},null,0]
[null,null,null,null,null,{"$f":"SUMIFS(تولید!E:E,تولید!C:C,C139,تولید!D:D,D139)","v":0},null,0]
[null,null,null,null,null,{"$f":"SUMIFS(تولید!E:E,تولید!C:C,C140,تولید!D:D,D140)","v":0},null,0]
[null,null,null,null,null,{"$f":"SUMIFS(تولید!E:E,تولید!C:C,C141,تولید!D:D,D141)","v":0},null,0]
[null,null,null,null,null,{"$f":"SUMIFS(تولید!E:E,تولید!C:C,C142,تولید!D:D,D142)","v":0},null,0]
[null,null,null,null,null,{"$f":"SUMIFS(تولید!E:E,تولید!C:C,C143,تولید!D:D,D143)","v":0},null,0]
[null,null,null,null,null,{"$f":"SUMIFS(تولید!E:E,تولید!C:C,C144,تولید!D:D,D144)","v":0},null,0]
[null,null,null,null,null,{"$f":"SUMIFS(تولید!E:E,تولید!C:C,C145,تولید!D:D,D145)","v":0},null,0]
[null,null,null,null,null,{"$f":"SUMIFS(تولید!E:E,تولید!C:C,C146,تولید!D:D,D146)","v":0},null,0]
[null,null,null,null,null,{"$f":"SUMIFS(تولید!E:E,تولید!C:C,C147,تولید!D:D,D147)","v":0},null,0]
[null,null,null,null,null,{"$f":"SUMIFS(تولید!E:E,تولید!C:C,C148,تولید!D:D,D148)","v":0},null,0]
[null,null,null,null,null,{"$f":"SUMIFS(تولید!E:E,تولید!C:C,C149,تولید!D:D,D149)","v":0},null,0]
[null,null,null,null,null,{"$f":"SUMIFS(تولید!E:E,تولید!C:C,C150,تولید!D:D,D150)","v":0},null,0]
[null,null,null,null,null,{"$f":"SUMIFS(تولید!E:E,تولید!C:C,C151,تولید!D:D,D151)","v":0},null,0]
[null,null,null,null,null,{"$f":"SUMIFS(تولید!E:E,تولید!C:C,C152,تولید!D:D,D152)","v":0},null,0]
[null,null,null,null,null,{"$f":"SUMIFS(تولید!E:E,تولید!C:C,C153,تولید!D:D,D153)","v":0},null,0]
[null,null,null,null,null,{"$f":"SUMIFS(تولید!E:E,تولید!C:C,C154,تولید!D:D,D154)","v":0},null,0]
[null,null,null,null,null,{"$f":"SUMIFS(تولید!E:E,تولید!C:C,C155,تولید!D:D,D155)","v":0},null,0]
[null,null,null,null,null,{"$f":"SUMIFS(تولید!E:E,تولید!C:C,C156,تولید!D:D,D156)","v":0},null,0]
[null,null,null,null,null,{"$f":"SUMIFS(تولید!E:E,تولید!C:C,C157,تولید!D:D,D157)","v":0},null,0]
[null,null,null,null,null,{"$f":"SUMIFS(تولید!E:E,تولید!C:C,C158,تولید!D:D,D158)","v":0},null,0]
[null,null,null,null,null,{"$f":"SUMIFS(تولید!E:E,تولید!C:C,C159,تولید!D:D,D159)","v":0},null,0]
[null,null,null,null,null,{"$f":"SUMIFS(تولید!E:E,تولید!C:C,C160,تولید!D:D,D160)","v":0},null,0]
[null,null,null,null,null,{"$f":"SUMIFS(تولید!E:E,تولید!C:C,C161,تولید!D:D,D161)","v":0},null,0]
[null,null,null,null,null,{"$f":"SUMIFS(تولید!E:E,تولید!C:C,C162,تولید!D:D,D162)","v":0},null,0]
[null,null,null,null,null,{"$f":"SUMIFS(تولید!E:E,تولید!C:C,C163,تولید!D:D,D163)","v":0},null,0]
[null,null,null,null,null,{"$f":"SUMIFS(تولید!E:E,تولید!C:C,C164,تولید!D:D,D164)","v":0},null,0]
[null,null,null,null,null,{"$f":"SUMIFS(تولید!E:E,تولید!C:C,C165,تولید!D:D,D165)","v":0},null,0]
[null,null,null,null,null,{"$f":"SUMIFS(تولید!E:E,تولید!C:C,C166,تولید!D:D,D166)","v":0},null,0]
[null,null,null,null,null,{"$f":"SUMIFS(تولید!E:E,تولید!C:C,C167,تولید!D:D,D167)","v":0},null,0]
[null,null,null,null,null,{"$f":"SUMIFS(تولید!E:E,تولید!C:C,C168,تولید!D:D,D168)","v":0},null,0]
[null,null,null,null,null,{"$f":"SUMIFS(تولید!E:E,تولید!C:C,C169,تولید!D:D,D169)","v":0},null,0]
[null,null,null,null,null,{"$f":"SUMIFS(تولید!E:E,تولید!C:C,C170,تولید!D:D,D170)","v":0},null,0]
[null,null,null,null,null,{"$f":"SUMIFS(تولید!E:E,تولید!C:C,C171,تولید!D:D,D171)","v":0},null,0]
[null,null,null,null,null,{"$f":"SUMIFS(تولید!E:E,تولید!C:C,C172,تولید!D:D,D172)","v":0},null,0]
[null,null,null,null,null,{"$f":"SUMIFS(تولید!E:E,تولید!C:C,C173,تولید!D:D,D173)","v":0},null,0]
[null,null,null,null,null,{"$f":"SUMIFS(تولید!E:E,تولید!C:C,C174,تولید!D:D,D174)","v":0},null,0]
[null,null,null,null,null,{"$f":"SUMIFS(تولید!E:E,تولید!C:C,C175,تولید!D:D,D175)","v":0},null,0]
[null,null,null,null,null,{"$f":"SUMIFS(تولید!E:E,تولید!C:C,C176,تولید!D:D,D176)","v":0},null,0]
[null,null,null,null,null,{"$f":"SUMIFS(تولید!E:E,تولید!C:C,C177,تولید!D:D,D177)","v":0},null,0]
[null,null,null,null,null,{"$f":"SUMIFS(تولید!E:E,تولید!C:C,C178,تولید!D:D,D178)","v":0},null,0]
[null,null,null,null,null,{"$f":"SUMIFS(تولید!E:E,تولید!C:C,C179,تولید!D:D,D179)","v":0},null,0]
[null,null,null,null,null,{"$f":"SUMIFS(تولید!E:E,تولید!C:C,C180,تولید!D:D,D180)","v":0},null,0]
[null,null,null,null,null,{"$f":"SUMIFS(تولید!E:E,تولید!C:C,C181,تولید!D:D,D181)","v":0},null,0]
[null,null,null,null,null,{"$f":"SUMIFS(تولید!E:E,تولید!C:C,C182,تولید!D:D,D182)","v":0},null,0]
[null,null,null,null,null,{"$f":"SUMIFS(تولید!E:E,تولید!C:C,C183,تولید!D:D,D183)","v":0},null,0]
[null,null,null,null,null,{"$f":"SUMIFS(تولید!E:E,تولید!C:C,C184,تولید!D:D,D184)","v":0},null,0]
[null,null,null,null,null,{"$f":"SUMIFS(تولید!E:E,تولید!C:C,C185,تولید!D:D,D185)","v":0},null,0]
[null,null,null,null,null,{"$f":"SUMIFS(تولید!E:E,تولید!C:C,C186,تولید!D:D,D186)","v":0},null,0]
[null,null,null,null,null,{"$f":"SUMIFS(تولید!E:E,تولید!C:C,C187,تولید!D:D,D187)","v":0},null,0]
[null,null,null,null,null,{"$f":"SUMIFS(تولید!E:E,تولید!C:C,C188,تولید!D:D,D188)","v":0},null,0]
[null,null,null,null,null,{"$f":"SUMIFS(تولید!E:E,تولید!C:C,C189,تولید!D:D,D189)","v":0},null,0]
[null,null,null,null,null,{"$f":"SUMIFS(تولید!E:E,تولید!C:C,C190,تولید!D:D,D190)","v":0},null,0]
[null,null,null,null,null,{"$f":"SUMIFS(تولید!E:E,تولید!C:C,C191,تولید!D:D,D191)","v":0},null,0]
[null,null,null,null,null,{"$f":"SUMIFS(تولید!E:E,تولید!C:C,C192,تولید!D:D,D192)","v":0},null,0]
[null,null,null,null,null,{"$f":"SUMIFS(تولید!E:E,تولید!C:C,C193,تولید!D:D,D193)","v":0},null,0]
[null,null,null,null,null,{"$f":"SUMIFS(تولید!E:E,تولید!C:C,C194,تولید!D:D,D194)","v":0},null,0]
[null,null,null,null,null,{"$f":"SUMIFS(تولید!E:E,تولید!C:C,C195,تولید!D:D,D195)","v":0},null,0]
[null,null,null,null,null,{"$f":"SUMIFS(تولید!E:E,تولید!C:C,C196,تولید!D:D,D196)","v":0},null,0]
[null,null,null,null,null,{"$f":"SUMIFS(تولید!E:E,تولید!C:C,C197,تولید!D:D,D197)","v":0},null,0]
[null,null,null,null,null,{"$f":"SUMIFS(تولید!E:E,تولید!C:C,C198,تولید!D:D,D198)","v":0},null,0]
[null,null,null,null,null,{"$f":"SUMIFS(تولید!E:E,تولید!C:C,C199,تولید!D:D,D199)","v":0},null,{"$f":"IF(E199-F199-G199>=0,E199-F199-G199,E199-F199-(-G199))","v":0}]
[null,null,null,null,null,{"$f":"SUMIFS(تولید!E:E,تولید!C:C,C200,تولید!D:D,D200)","v":0},null,0]
[null,null,null,null,null,{"$f":"SUMIFS(تولید!E:E,تولید!C:C,C201,تولید!D:D,D201)","v":0},null,0]
[null,null,null,null,null,{"$f":"SUMIFS(تولید!E:E,تولید!C:C,C202,تولید!D:D,D202)","v":0},null,0]
[null,null,null,null,null,{"$f":"SUMIFS(تولید!E:E,تولید!C:C,C203,تولید!D:D,D203)","v":0},null,0]
[null,null,null,null,null,{"$f":"SUMIFS(تولید!E:E,تولید!C:C,C204,تولید!D:D,D204)","v":0},null,0]
[null,null,null,null,null,{"$f":"SUMIFS(تولید!E:E,تولید!C:C,C205,تولید!D:D,D205)","v":0},null,0]
[null,null,null,null,null,{"$f":"SUMIFS(تولید!E:E,تولید!C:C,C206,تولید!D:D,D206)","v":0},null,0]
[null,null,null,null,null,{"$f":"SUMIFS(تولید!E:E,تولید!C:C,C207,تولید!D:D,D207)","v":0},null,0]
[null,null,null,null,null,{"$f":"SUMIFS(تولید!E:E,تولید!C:C,C208,تولید!D:D,D208)","v":0},null,0]
[null,null,null,null,null,{"$f":"SUMIFS(تولید!E:E,تولید!C:C,C209,تولید!D:D,D209)","v":0},null,0]
[null,null,null,null,null,{"$f":"SUMIFS(تولید!E:E,تولید!C:C,C210,تولید!D:D,D210)","v":0},null,0]
[null,null,null,null,null,{"$f":"SUMIFS(تولید!E:E,تولید!C:C,C211,تولید!D:D,D211)","v":0},null,0]
[null,null,null,null,null,{"$f":"SUMIFS(تولید!E:E,تولید!C:C,C212,تولید!D:D,D212)","v":0},null,0]
[null,null,null,null,null,{"$f":"SUMIFS(تولید!E:E,تولید!C:C,C213,تولید!D:D,D213)","v":0},null,0]
[null,null,null,null,null,{"$f":"SUMIFS(تولید!E:E,تولید!C:C,C214,تولید!D:D,D214)","v":0},null,0]
[null,null,null,null,null,{"$f":"SUMIFS(تولید!E:E,تولید!C:C,C215,تولید!D:D,D215)","v":0},null,0]
[null,null,null,null,null,{"$f":"SUMIFS(تولید!E:E,تولید!C:C,C216,تولید!D:D,D216)","v":0},null,0]
[null,null,null,null,null,{"$f":"SUMIFS(تولید!E:E,تولید!C:C,C217,تولید!D:D,D217)","v":0},null,0]
[null,null,null,null,null,{"$f":"SUMIFS(تولید!E:E,تولید!C:C,C218,تولید!D:D,D218)","v":0},null,0]
[null,null,null,null,null,{"$f":"SUMIFS(تولید!E:E,تولید!C:C,C219,تولید!D:D,D219)","v":0},null,0]
[null,null,null,null,null,{"$f":"SUMIFS(تولید!E:E,تولید!C:C,C220,تولید!D:D,D220)","v":0},null,0]
[null,null,null,null,null,{"$f":"SUMIFS(تولید!E:E,تولید!C:C,C221,تولید!D:D,D221)","v":0},null,0]
[null,null,null,null,null,{"$f":"SUMIFS(تولید!E:E,تولید!C:C,C222,تولید!D:D,D222)","v":0},null,0]
[null,null,null,null,null,{"$f":"SUMIFS(تولید!E:E,تولید!C:C,C223,تولید!D:D,D223)","v":0},null,0]
[null,null,null,null,null,{"$f":"SUMIFS(تولید!E:E,تولید!C:C,C224,تولید!D:D,D224)","v":0},null,0]
[null,null,null,null,null,{"$f":"SUMIFS(تولید!E:E,تولید!C:C,C225,تولید!D:D,D225)","v":0},null,0]
[null,null,null,null,null,{"$f":"SUMIFS(تولید!E:E,تولید!C:C,C226,تولید!D:D,D226)","v":0},null,0]
[null,null,null,null,null,{"$f":"SUMIFS(تولید!E:E,تولید!C:C,C227,تولید!D:D,D227)","v":0},null,0]
[null,null,null,null,null,{"$f":"SUMIFS(تولید!E:E,تولید!C:C,C228,تولید!D:D,D228)","v":0},null,0]
[null,null,null,null,null,{"$f":"SUMIFS(تولید!E:E,تولید!C:C,C229,تولید!D:D,D229)","v":0},null,0]
[null,null,null,null,null,{"$f":"SUMIFS(تولید!E:E,تولید!C:C,C230,تولید!D:D,D230)","v":0},null,0]
[null,null,null,null,null,{"$f":"SUMIFS(تولید!E:E,تولید!C:C,C231,تولید!D:D,D231)","v":0},null,0]
[null,null,null,null,null,{"$f":"SUMIFS(تولید!E:E,تولید!C:C,C232,تولید!D:D,D232)","v":0},null,0]
[null,null,null,null,null,{"$f":"SUMIFS(تولید!E:E,تولید!C:C,C233,تولید!D:D,D233)","v":0},null,0]
[null,null,null,null,null,{"$f":"SUMIFS(تولید!E:E,تولید!C:C,C234,تولید!D:D,D234)","v":0},null,0]
[null,null,null,null,null,{"$f":"SUMIFS(تولید!E:E,تولید!C:C,C235,تولید!D:D,D235)","v":0},null,0]
[null,null,null,null,null,{"$f":"SUMIFS(تولید!E:E,تولید!C:C,C236,تولید!D:D,D236)","v":0},null,0]
[null,null,null,null,null,{"$f":"SUMIFS(تولید!E:E,تولید!C:C,C237,تولید!D:D,D237)","v":0},null,0]
[null,null,null,null,null,{"$f":"SUMIFS(تولید!E:E,تولید!C:C,C238,تولید!D:D,D238)","v":0},null,0]
[null,null,null,null,null,{"$f":"SUMIFS(تولید!E:E,تولید!C:C,C239,تولید!D:D,D239)","v":0},null,0]
[null,null,null,null,null,{"$f":"SUMIFS(تولید!E:E,تولید!C:C,C240,تولید!D:D,D240)","v":0},null,0]
[null,null,null,null,null,{"$f":"SUMIFS(تولید!E:E,تولید!C:C,C241,تولید!D:D,D241)","v":0},null,0]
[null,null,null,null,null,{"$f":"SUMIFS(تولید!E:E,تولید!C:C,C242,تولید!D:D,D242)","v":0},null,0]
[null,null,null,null,null,{"$f":"SUMIFS(تولید!E:E,تولید!C:C,C243,تولید!D:D,D243)","v":0},null,0]
[null,null,null,null,null,{"$f":"SUMIFS(تولید!E:E,تولید!C:C,C244,تولید!D:D,D244)","v":0},null,0]
[null,null,null,null,null,{"$f":"SUMIFS(تولید!E:E,تولید!C:C,C245,تولید!D:D,D245)","v":0},null,0]
[null,null,null,null,null,{"$f":"SUMIFS(تولید!E:E,تولید!C:C,C246,تولید!D:D,D246)","v":0},null,0]
[null,null,null,null,null,{"$f":"SUMIFS(تولید!E:E,تولید!C:C,C247,تولید!D:D,D247)","v":0},null,0]
[null,null,null,null,null,{"$f":"SUMIFS(تولید!E:E,تولید!C:C,C248,تولید!D:D,D248)","v":0},null,0]
[null,null,null,null,null,{"$f":"SUMIFS(تولید!E:E,تولید!C:C,C249,تولید!D:D,D249)","v":0},null,0]
[null,null,null,null,null,{"$f":"SUMIFS(تولید!E:E,تولید!C:C,C250,تولید!D:D,D250)","v":0},null,0]
[null,null,null,null,null,{"$f":"SUMIFS(تولید!E:E,تولید!C:C,C251,تولید!D:D,D251)","v":0},null,0]
[null,null,null,null,null,{"$f":"SUMIFS(تولید!E:E,تولید!C:C,C252,تولید!D:D,D252)","v":0},null,0]
[null,null,null,null,null,{"$f":"SUMIFS(تولید!E:E,تولید!C:C,C253,تولید!D:D,D253)","v":0},null,0]
[null,null,null,null,null,{"$f":"SUMIFS(تولید!E:E,تولید!C:C,C254,تولید!D:D,D254)","v":0},null,0]
[null,null,null,null,null,{"$f":"SUMIFS(تولید!E:E,تولید!C:C,C255,تولید!D:D,D255)","v":0},null,0]
[null,null,null,null,null,{"$f":"SUMIFS(تولید!E:E,تولید!C:C,C256,تولید!D:D,D256)","v":0},null,0]
[null,null,null,null,null,{"$f":"SUMIFS(تولید!E:E,تولید!C:C,C257,تولید!D:D,D257)","v":0},null,0]
[null,null,null,null,null,{"$f":"SUMIFS(تولید!E:E,تولید!C:C,C258,تولید!D:D,D258)","v":0},null,0]
[null,null,null,null,null,{"$f":"SUMIFS(تولید!E:E,تولید!C:C,C259,تولید!D:D,D259)","v":0},null,0]
[null,null,null,null,null,{"$f":"SUMIFS(تولید!E:E,تولید!C:C,C260,تولید!D:D,D260)","v":0},null,0]
[null,null,null,null,null,{"$f":"SUMIFS(تولید!E:E,تولید!C:C,C261,تولید!D:D,D261)","v":0},null,0]
[null,null,null,null,null,{"$f":"SUMIFS(تولید!E:E,تولید!C:C,C262,تولید!D:D,D262)","v":0},null,0]
[null,null,null,null,null,{"$f":"SUMIFS(تولید!E:E,تولید!C:C,C263,تولید!D:D,D263)","v":0},null,{"$f":"IF(E263-F263-G263>=0,E263-F263-G263,E263-F263-(-G263))","v":0}]
[null,null,null,null,null,{"$f":"SUMIFS(تولید!E:E,تولید!C:C,C264,تولید!D:D,D264)","v":0},null,0]
[null,null,null,null,null,{"$f":"SUMIFS(تولید!E:E,تولید!C:C,C265,تولید!D:D,D265)","v":0},null,0]
[null,null,null,null,null,{"$f":"SUMIFS(تولید!E:E,تولید!C:C,C266,تولید!D:D,D266)","v":0},null,0]
[null,null,null,null,null,{"$f":"SUMIFS(تولید!E:E,تولید!C:C,C267,تولید!D:D,D267)","v":0},null,0]
[null,null,null,null,null,{"$f":"SUMIFS(تولید!E:E,تولید!C:C,C268,تولید!D:D,D268)","v":0},null,0]
[null,null,null,null,null,{"$f":"SUMIFS(تولید!E:E,تولید!C:C,C269,تولید!D:D,D269)","v":0},null,0]
[null,null,null,null,null,{"$f":"SUMIFS(تولید!E:E,تولید!C:C,C270,تولید!D:D,D270)","v":0},null,0]
[null,null,null,null,null,{"$f":"SUMIFS(تولید!E:E,تولید!C:C,C271,تولید!D:D,D271)","v":0},null,0]
[null,null,null,null,null,{"$f":"SUMIFS(تولید!E:E,تولید!C:C,C272,تولید!D:D,D272)","v":0},null,0]
[null,null,null,null,null,{"$f":"SUMIFS(تولید!E:E,تولید!C:C,C273,تولید!D:D,D273)","v":0},null,0]
[null,null,null,null,null,{"$f":"SUMIFS(تولید!E:E,تولید!C:C,C274,تولید!D:D,D274)","v":0},null,0]
[null,null,null,null,null,{"$f":"SUMIFS(تولید!E:E,تولید!C:C,C275,تولید!D:D,D275)","v":0},null,0]
[null,null,null,null,null,{"$f":"SUMIFS(تولید!E:E,تولید!C:C,C276,تولید!D:D,D276)","v":0},null,0]
[null,null,null,null,null,{"$f":"SUMIFS(تولید!E:E,تولید!C:C,C277,تولید!D:D,D277)","v":0},null,0]
[null,null,null,null,null,{"$f":"SUMIFS(تولید!E:E,تولید!C:C,C278,تولید!D:D,D278)","v":0},null,0]
[null,null,null,null,null,{"$f":"SUMIFS(تولید!E:E,تولید!C:C,C279,تولید!D:D,D279)","v":0},null,0]
[null,null,null,null,null,{"$f":"SUMIFS(تولید!E:E,تولید!C:C,C280,تولید!D:D,D280)","v":0},null,0]
[null,null,null,null,null,{"$f":"SUMIFS(تولید!E:E,تولید!C:C,C281,تولید!D:D,D281)","v":0},null,0]
[null,null,null,null,null,{"$f":"SUMIFS(تولید!E:E,تولید!C:C,C282,تولید!D:D,D282)","v":0},null,0]
[null,null,null,null,null,{"$f":"SUMIFS(تولید!E:E,تولید!C:C,C283,تولید!D:D,D283)","v":0},null,0]
[null,null,null,null,null,{"$f":"SUMIFS(تولید!E:E,تولید!C:C,C284,تولید!D:D,D284)","v":0},null,0]
[null,null,null,null,null,{"$f":"SUMIFS(تولید!E:E,تولید!C:C,C285,تولید!D:D,D285)","v":0},null,0]
[null,null,null,null,null,{"$f":"SUMIFS(تولید!E:E,تولید!C:C,C286,تولید!D:D,D286)","v":0},null,0]
[null,null,null,null,null,{"$f":"SUMIFS(تولید!E:E,تولید!C:C,C287,تولید!D:D,D287)","v":0},null,0]
[null,null,null,null,null,{"$f":"SUMIFS(تولید!E:E,تولید!C:C,C288,تولید!D:D,D288)","v":0},null,0]
[null,null,null,null,null,{"$f":"SUMIFS(تولید!E:E,تولید!C:C,C289,تولید!D:D,D289)","v":0},null,0]
[null,null,null,null,null,{"$f":"SUMIFS(تولید!E:E,تولید!C:C,C290,تولید!D:D,D290)","v":0},null,0]
[null,null,null,null,null,{"$f":"SUMIFS(تولید!E:E,تولید!C:C,C291,تولید!D:D,D291)","v":0},null,0]
[null,null,null,null,null,{"$f":"SUMIFS(تولید!E:E,تولید!C:C,C292,تولید!D:D,D292)","v":0},null,0]
[null,null,null,null,null,{"$f":"SUMIFS(تولید!E:E,تولید!C:C,C293,تولید!D:D,D293)","v":0},null,0]
[null,null,null,null,null,{"$f":"SUMIFS(تولید!E:E,تولید!C:C,C294,تولید!D:D,D294)","v":0},null,0]
[null,null,null,null,null,{"$f":"SUMIFS(تولید!E:E,تولید!C:C,C295,تولید!D:D,D295)","v":0},null,0]
[null,null,null,null,null,{"$f":"SUMIFS(تولید!E:E,تولید!C:C,C296,تولید!D:D,D296)","v":0},null,0]
[null,null,null,null,null,{"$f":"SUMIFS(تولید!E:E,تولید!C:C,C297,تولید!D:D,D297)","v":0},null,0]
[null,null,null,null,null,{"$f":"SUMIFS(تولید!E:E,تولید!C:C,C298,تولید!D:D,D298)","v":0},null,0]
[null,null,null,null,null,{"$f":"SUMIFS(تولید!E:E,تولید!C:C,C299,تولید!D:D,D299)","v":0},null,0]
[null,null,null,null,null,{"$f":"SUMIFS(تولید!E:E,تولید!C:C,C300,تولید!D:D,D300)","v":0},null,0]
[null,null,null,null,null,{"$f":"SUMIFS(تولید!E:E,تولید!C:C,C301,تولید!D:D,D301)","v":0},null,0]
[null,null,null,null,null,{"$f":"SUMIFS(تولید!E:E,تولید!C:C,C302,تولید!D:D,D302)","v":0},null,0]
[null,null,null,null,null,{"$f":"SUMIFS(تولید!E:E,تولید!C:C,C303,تولید!D:D,D303)","v":0},null,0]
[null,null,null,null,null,{"$f":"SUMIFS(تولید!E:E,تولید!C:C,C304,تولید!D:D,D304)","v":0},null,0]
[null,null,null,null,null,{"$f":"SUMIFS(تولید!E:E,تولید!C:C,C305,تولید!D:D,D305)","v":0},null,0]
[null,null,null,null,null,{"$f":"SUMIFS(تولید!E:E,تولید!C:C,C306,تولید!D:D,D306)","v":0},null,0]
[null,null,null,null,null,{"$f":"SUMIFS(تولید!E:E,تولید!C:C,C307,تولید!D:D,D307)","v":0},null,0]
[null,null,null,null,null,{"$f":"SUMIFS(تولید!E:E,تولید!C:C,C308,تولید!D:D,D308)","v":0},null,0]
[null,null,null,null,null,{"$f":"SUMIFS(تولید!E:E,تولید!C:C,C309,تولید!D:D,D309)","v":0},null,0]
[null,null,null,null,null,{"$f":"SUMIFS(تولید!E:E,تولید!C:C,C310,تولید!D:D,D310)","v":0},null,0]
[null,null,null,null,null,{"$f":"SUMIFS(تولید!E:E,تولید!C:C,C311,تولید!D:D,D311)","v":0},null,0]
[null,null,null,null,null,{"$f":"SUMIFS(تولید!E:E,تولید!C:C,C312,تولید!D:D,D312)","v":0},null,0]
[null,null,null,null,null,{"$f":"SUMIFS(تولید!E:E,تولید!C:C,C313,تولید!D:D,D313)","v":0},null,0]
[null,null,null,null,null,{"$f":"SUMIFS(تولید!E:E,تولید!C:C,C314,تولید!D:D,D314)","v":0},null,0]
[null,null,null,null,null,{"$f":"SUMIFS(تولید!E:E,تولید!C:C,C315,تولید!D:D,D315)","v":0},null,0]
[null,null,null,null,null,{"$f":"SUMIFS(تولید!E:E,تولید!C:C,C316,تولید!D:D,D316)","v":0},null,0]
[null,null,null,null,null,{"$f":"SUMIFS(تولید!E:E,تولید!C:C,C317,تولید!D:D,D317)","v":0},null,0]
[null,null,null,null,null,{"$f":"SUMIFS(تولید!E:E,تولید!C:C,C318,تولید!D:D,D318)","v":0},null,0]
[null,null,null,null,null,{"$f":"SUMIFS(تولید!E:E,تولید!C:C,C319,تولید!D:D,D319)","v":0},null,0]
[null,null,null,null,null,{"$f":"SUMIFS(تولید!E:E,تولید!C:C,C320,تولید!D:D,D320)","v":0},null,0]
[null,null,null,null,null,{"$f":"SUMIFS(تولید!E:E,تولید!C:C,C321,تولید!D:D,D321)","v":0},null,0]
[null,null,null,null,null,{"$f":"SUMIFS(تولید!E:E,تولید!C:C,C322,تولید!D:D,D322)","v":0},null,0]
[null,null,null,null,null,{"$f":"SUMIFS(تولید!E:E,تولید!C:C,C323,تولید!D:D,D323)","v":0},null,0]
[null,null,null,null,null,{"$f":"SUMIFS(تولید!E:E,تولید!C:C,C324,تولید!D:D,D324)","v":0},null,0]
[null,null,null,null,null,{"$f":"SUMIFS(تولید!E:E,تولید!C:C,C325,تولید!D:D,D325)","v":0},null,0]
[null,null,null,null,null,{"$f":"SUMIFS(تولید!E:E,تولید!C:C,C326,تولید!D:D,D326)","v":0},null,0]
[null,null,null,null,null,{"$f":"SUMIFS(تولید!E:E,تولید!C:C,C327,تولید!D:D,D327)","v":0},null,{"$f":"IF(E327-F327-G327>=0,E327-F327-G327,E327-F327-(-G327))","v":0}]
[null,null,null,null,null,{"$f":"SUMIFS(تولید!E:E,تولید!C:C,C328,تولید!D:D,D328)","v":0},null,0]
[null,null,null,null,null,{"$f":"SUMIFS(تولید!E:E,تولید!C:C,C329,تولید!D:D,D329)","v":0},null,0]
[null,null,null,null,null,{"$f":"SUMIFS(تولید!E:E,تولید!C:C,C330,تولید!D:D,D330)","v":0},null,0]
[null,null,null,null,null,{"$f":"SUMIFS(تولید!E:E,تولید!C:C,C331,تولید!D:D,D331)","v":0},null,0]
[null,null,null,null,null,{"$f":"SUMIFS(تولید!E:E,تولید!C:C,C332,تولید!D:D,D332)","v":0},null,0]
[null,null,null,null,null,{"$f":"SUMIFS(تولید!E:E,تولید!C:C,C333,تولید!D:D,D333)","v":0},null,0]
[null,null,null,null,null,{"$f":"SUMIFS(تولید!E:E,تولید!C:C,C334,تولید!D:D,D334)","v":0},null,0]
[null,null,null,null,null,{"$f":"SUMIFS(تولید!E:E,تولید!C:C,C335,تولید!D:D,D335)","v":0},null,0]
[null,null,null,null,null,{"$f":"SUMIFS(تولید!E:E,تولید!C:C,C336,تولید!D:D,D336)","v":0},null,0]
[null,null,null,null,null,{"$f":"SUMIFS(تولید!E:E,تولید!C:C,C337,تولید!D:D,D337)","v":0},null,0]
[null,null,null,null,null,{"$f":"SUMIFS(تولید!E:E,تولید!C:C,C338,تولید!D:D,D338)","v":0},null,0]
[null,null,null,null,null,{"$f":"SUMIFS(تولید!E:E,تولید!C:C,C339,تولید!D:D,D339)","v":0},null,0]
[null,null,null,null,null,{"$f":"SUMIFS(تولید!E:E,تولید!C:C,C340,تولید!D:D,D340)","v":0},null,0]
[null,null,null,null,null,{"$f":"SUMIFS(تولید!E:E,تولید!C:C,C341,تولید!D:D,D341)","v":0},null,0]
[null,null,null,null,null,{"$f":"SUMIFS(تولید!E:E,تولید!C:C,C342,تولید!D:D,D342)","v":0},null,0]
[null,null,null,null,null,{"$f":"SUMIFS(تولید!E:E,تولید!C:C,C343,تولید!D:D,D343)","v":0},null,0]
[null,null,null,null,null,{"$f":"SUMIFS(تولید!E:E,تولید!C:C,C344,تولید!D:D,D344)","v":0},null,0]
[null,null,null,null,null,{"$f":"SUMIFS(تولید!E:E,تولید!C:C,C345,تولید!D:D,D345)","v":0},null,0]
[null,null,null,null,null,{"$f":"SUMIFS(تولید!E:E,تولید!C:C,C346,تولید!D:D,D346)","v":0},null,0]
[null,null,null,null,null,{"$f":"SUMIFS(تولید!E:E,تولید!C:C,C347,تولید!D:D,D347)","v":0},null,0]
[null,null,null,null,null,{"$f":"SUMIFS(تولید!E:E,تولید!C:C,C348,تولید!D:D,D348)","v":0},null,0]
[null,null,null,null,null,{"$f":"SUMIFS(تولید!E:E,تولید!C:C,C349,تولید!D:D,D349)","v":0},null,0]
[null,null,null,null,null,{"$f":"SUMIFS(تولید!E:E,تولید!C:C,C350,تولید!D:D,D350)","v":0},null,0]
[null,null,null,null,null,{"$f":"SUMIFS(تولید!E:E,تولید!C:C,C351,تولید!D:D,D351)","v":0},null,0]
[null,null,null,null,null,{"$f":"SUMIFS(تولید!E:E,تولید!C:C,C352,تولید!D:D,D352)","v":0},null,0]
[null,null,null,null,null,{"$f":"SUMIFS(تولید!E:E,تولید!C:C,C353,تولید!D:D,D353)","v":0},null,0]
[null,null,null,null,null,{"$f":"SUMIFS(تولید!E:E,تولید!C:C,C354,تولید!D:D,D354)","v":0},null,0]
[null,null,null,null,null,{"$f":"SUMIFS(تولید!E:E,تولید!C:C,C355,تولید!D:D,D355)","v":0},null,0]
[null,null,null,null,null,{"$f":"SUMIFS(تولید!E:E,تولید!C:C,C356,تولید!D:D,D356)","v":0},null,0]
[null,null,null,null,null,{"$f":"SUMIFS(تولید!E:E,تولید!C:C,C357,تولید!D:D,D357)","v":0},null,0]
[null,null,null,null,null,{"$f":"SUMIFS(تولید!E:E,تولید!C:C,C358,تولید!D:D,D358)","v":0},null,0]
[null,null,null,null,null,{"$f":"SUMIFS(تولید!E:E,تولید!C:C,C359,تولید!D:D,D359)","v":0},null,0]
[null,null,null,null,null,{"$f":"SUMIFS(تولید!E:E,تولید!C:C,C360,تولید!D:D,D360)","v":0},null,0]
[null,null,null,null,null,{"$f":"SUMIFS(تولید!E:E,تولید!C:C,C361,تولید!D:D,D361)","v":0},null,0]
[null,null,null,null,null,{"$f":"SUMIFS(تولید!E:E,تولید!C:C,C362,تولید!D:D,D362)","v":0},null,0]
[null,null,null,null,null,{"$f":"SUMIFS(تولید!E:E,تولید!C:C,C363,تولید!D:D,D363)","v":0},null,0]
[null,null,null,null,null,{"$f":"SUMIFS(تولید!E:E,تولید!C:C,C364,تولید!D:D,D364)","v":0},null,0]
[null,null,null,null,null,{"$f":"SUMIFS(تولید!E:E,تولید!C:C,C365,تولید!D:D,D365)","v":0},null,0]
[null,null,null,null,null,{"$f":"SUMIFS(تولید!E:E,تولید!C:C,C366,تولید!D:D,D366)","v":0},null,0]
[null,null,null,null,null,{"$f":"SUMIFS(تولید!E:E,تولید!C:C,C367,تولید!D:D,D367)","v":0},null,0]
[null,null,null,null,null,{"$f":"SUMIFS(تولید!E:E,تولید!C:C,C368,تولید!D:D,D368)","v":0},null,0]
[null,null,null,null,null,{"$f":"SUMIFS(تولید!E:E,تولید!C:C,C369,تولید!D:D,D369)","v":0},null,0]
[null,null,null,null,null,{"$f":"SUMIFS(تولید!E:E,تولید!C:C,C370,تولید!D:D,D370)","v":0},null,0]
[null,null,null,null,null,{"$f":"SUMIFS(تولید!E:E,تولید!C:C,C371,تولید!D:D,D371)","v":0},null,0]
[null,null,null,null,null,{"$f":"SUMIFS(تولید!E:E,تولید!C:C,C372,تولید!D:D,D372)","v":0},null,0]
[null,null,null,null,null,{"$f":"SUMIFS(تولید!E:E,تولید!C:C,C373,تولید!D:D,D373)","v":0},null,0]
[null,null,null,null,null,{"$f":"SUMIFS(تولید!E:E,تولید!C:C,C374,تولید!D:D,D374)","v":0},null,0]
[null,null,null,null,null,{"$f":"SUMIFS(تولید!E:E,تولید!C:C,C375,تولید!D:D,D375)","v":0},null,0]
[null,null,null,null,null,{"$f":"SUMIFS(تولید!E:E,تولید!C:C,C376,تولید!D:D,D376)","v":0},null,0]
[null,null,null,null,null,{"$f":"SUMIFS(تولید!E:E,تولید!C:C,C377,تولید!D:D,D377)","v":0},null,0]
[null,null,null,null,null,{"$f":"SUMIFS(تولید!E:E,تولید!C:C,C378,تولید!D:D,D378)","v":0},null,0]
[null,null,null,null,null,{"$f":"SUMIFS(تولید!E:E,تولید!C:C,C379,تولید!D:D,D379)","v":0},null,0]
[null,null,null,null,null,{"$f":"SUMIFS(تولید!E:E,تولید!C:C,C380,تولید!D:D,D380)","v":0},null,0]
[null,null,null,null,null,{"$f":"SUMIFS(تولید!E:E,تولید!C:C,C381,تولید!D:D,D381)","v":0},null,0]
[null,null,null,null,null,{"$f":"SUMIFS(تولید!E:E,تولید!C:C,C382,تولید!D:D,D382)","v":0},null,0]
[null,null,null,null,null,{"$f":"SUMIFS(تولید!E:E,تولید!C:C,C383,تولید!D:D,D383)","v":0},null,0]
[null,null,null,null,null,{"$f":"SUMIFS(تولید!E:E,تولید!C:C,C384,تولید!D:D,D384)","v":0},null,0]
[null,null,null,null,null,{"$f":"SUMIFS(تولید!E:E,تولید!C:C,C385,تولید!D:D,D385)","v":0},null,0]
[null,null,null,null,null,{"$f":"SUMIFS(تولید!E:E,تولید!C:C,C386,تولید!D:D,D386)","v":0},null,0]
[null,null,null,null,null,{"$f":"SUMIFS(تولید!E:E,تولید!C:C,C387,تولید!D:D,D387)","v":0},null,0]
[null,null,null,null,null,{"$f":"SUMIFS(تولید!E:E,تولید!C:C,C388,تولید!D:D,D388)","v":0},null,0]
[null,null,null,null,null,{"$f":"SUMIFS(تولید!E:E,تولید!C:C,C389,تولید!D:D,D389)","v":0},null,0]
[null,null,null,null,null,{"$f":"SUMIFS(تولید!E:E,تولید!C:C,C390,تولید!D:D,D390)","v":0},null,0]
[null,null,null,null,null,{"$f":"SUMIFS(تولید!E:E,تولید!C:C,C391,تولید!D:D,D391)","v":0},null,{"$f":"IF(E391-F391-G391>=0,E391-F391-G391,E391-F391-(-G391))","v":0}]
[null,null,null,null,null,{"$f":"SUMIFS(تولید!E:E,تولید!C:C,C392,تولید!D:D,D392)","v":0},null,0]
[null,null,null,null,null,{"$f":"SUMIFS(تولید!E:E,تولید!C:C,C393,تولید!D:D,D393)","v":0},null,0]
[null,null,null,null,null,{"$f":"SUMIFS(تولید!E:E,تولید!C:C,C394,تولید!D:D,D394)","v":0},null,0]
[null,null,null,null,null,{"$f":"SUMIFS(تولید!E:E,تولید!C:C,C395,تولید!D:D,D395)","v":0},null,0]
[null,null,null,null,null,{"$f":"SUMIFS(تولید!E:E,تولید!C:C,C396,تولید!D:D,D396)","v":0},null,0]
[null,null,null,null,null,{"$f":"SUMIFS(تولید!E:E,تولید!C:C,C397,تولید!D:D,D397)","v":0},null,0]
[null,null,null,null,null,{"$f":"SUMIFS(تولید!E:E,تولید!C:C,C398,تولید!D:D,D398)","v":0},null,0]
[null,null,null,null,null,{"$f":"SUMIFS(تولید!E:E,تولید!C:C,C399,تولید!D:D,D399)","v":0},null,0]
[null,null,null,null,null,{"$f":"SUMIFS(تولید!E:E,تولید!C:C,C400,تولید!D:D,D400)","v":0},null,0]
[null,null,null,null,null,{"$f":"SUMIFS(تولید!E:E,تولید!C:C,C401,تولید!D:D,D401)","v":0},null,0]
[null,null,null,null,null,{"$f":"SUMIFS(تولید!E:E,تولید!C:C,C402,تولید!D:D,D402)","v":0},null,0]
[null,null,null,null,null,{"$f":"SUMIFS(تولید!E:E,تولید!C:C,C403,تولید!D:D,D403)","v":0},null,0]
[null,null,null,null,null,{"$f":"SUMIFS(تولید!E:E,تولید!C:C,C404,تولید!D:D,D404)","v":0},null,0]
[null,null,null,null,null,{"$f":"SUMIFS(تولید!E:E,تولید!C:C,C405,تولید!D:D,D405)","v":0},null,0]
[null,null,null,null,null,{"$f":"SUMIFS(تولید!E:E,تولید!C:C,C406,تولید!D:D,D406)","v":0},null,0]
[null,null,null,null,null,{"$f":"SUMIFS(تولید!E:E,تولید!C:C,C407,تولید!D:D,D407)","v":0},null,0]
[null,null,null,null,null,{"$f":"SUMIFS(تولید!E:E,تولید!C:C,C408,تولید!D:D,D408)","v":0},null,0]
[null,null,null,null,null,{"$f":"SUMIFS(تولید!E:E,تولید!C:C,C409,تولید!D:D,D409)","v":0},null,0]
[null,null,null,null,null,{"$f":"SUMIFS(تولید!E:E,تولید!C:C,C410,تولید!D:D,D410)","v":0},null,0]
[null,null,null,null,null,{"$f":"SUMIFS(تولید!E:E,تولید!C:C,C411,تولید!D:D,D411)","v":0},null,0]
[null,null,null,null,null,{"$f":"SUMIFS(تولید!E:E,تولید!C:C,C412,تولید!D:D,D412)","v":0},null,0]
[null,null,null,null,null,{"$f":"SUMIFS(تولید!E:E,تولید!C:C,C413,تولید!D:D,D413)","v":0},null,0]
[null,null,null,null,null,{"$f":"SUMIFS(تولید!E:E,تولید!C:C,C414,تولید!D:D,D414)","v":0},null,0]
[null,null,null,null,null,{"$f":"SUMIFS(تولید!E:E,تولید!C:C,C415,تولید!D:D,D415)","v":0},null,0]
[null,null,null,null,null,{"$f":"SUMIFS(تولید!E:E,تولید!C:C,C416,تولید!D:D,D416)","v":0},null,0]
[null,null,null,null,null,{"$f":"SUMIFS(تولید!E:E,تولید!C:C,C417,تولید!D:D,D417)","v":0},null,0]
[null,null,null,null,null,{"$f":"SUMIFS(تولید!E:E,تولید!C:C,C418,تولید!D:D,D418)","v":0},null,0]
[null,null,null,null,null,{"$f":"SUMIFS(تولید!E:E,تولید!C:C,C419,تولید!D:D,D419)","v":0},null,0]
[null,null,null,null,null,{"$f":"SUMIFS(تولید!E:E,تولید!C:C,C420,تولید!D:D,D420)","v":0},null,0]
[null,null,null,null,null,{"$f":"SUMIFS(تولید!E:E,تولید!C:C,C421,تولید!D:D,D421)","v":0},null,0]
[null,null,null,null,null,{"$f":"SUMIFS(تولید!E:E,تولید!C:C,C422,تولید!D:D,D422)","v":0},null,0]
[null,null,null,null,null,{"$f":"SUMIFS(تولید!E:E,تولید!C:C,C423,تولید!D:D,D423)","v":0},null,0]
[null,null,null,null,null,{"$f":"SUMIFS(تولید!E:E,تولید!C:C,C424,تولید!D:D,D424)","v":0},null,0]
[null,null,null,null,null,{"$f":"SUMIFS(تولید!E:E,تولید!C:C,C425,تولید!D:D,D425)","v":0},null,0]
[null,null,null,null,null,{"$f":"SUMIFS(تولید!E:E,تولید!C:C,C426,تولید!D:D,D426)","v":0},null,0]
[null,null,null,null,null,{"$f":"SUMIFS(تولید!E:E,تولید!C:C,C427,تولید!D:D,D427)","v":0},null,0]
[null,null,null,null,null,{"$f":"SUMIFS(تولید!E:E,تولید!C:C,C428,تولید!D:D,D428)","v":0},null,0]
[null,null,null,null,null,{"$f":"SUMIFS(تولید!E:E,تولید!C:C,C429,تولید!D:D,D429)","v":0},null,0]
[null,null,null,null,null,{"$f":"SUMIFS(تولید!E:E,تولید!C:C,C430,تولید!D:D,D430)","v":0},null,0]
[null,null,null,null,null,{"$f":"SUMIFS(تولید!E:E,تولید!C:C,C431,تولید!D:D,D431)","v":0},null,0]
[null,null,null,null,null,{"$f":"SUMIFS(تولید!E:E,تولید!C:C,C432,تولید!D:D,D432)","v":0},null,0]
[null,null,null,null,null,{"$f":"SUMIFS(تولید!E:E,تولید!C:C,C433,تولید!D:D,D433)","v":0},null,0]
[null,null,null,null,null,{"$f":"SUMIFS(تولید!E:E,تولید!C:C,C434,تولید!D:D,D434)","v":0},null,0]
[null,null,null,null,null,{"$f":"SUMIFS(تولید!E:E,تولید!C:C,C435,تولید!D:D,D435)","v":0},null,0]
[null,null,null,null,null,{"$f":"SUMIFS(تولید!E:E,تولید!C:C,C436,تولید!D:D,D436)","v":0},null,0]
[null,null,null,null,null,{"$f":"SUMIFS(تولید!E:E,تولید!C:C,C437,تولید!D:D,D437)","v":0},null,0]
[null,null,null,null,null,{"$f":"SUMIFS(تولید!E:E,تولید!C:C,C438,تولید!D:D,D438)","v":0},null,0]
[null,null,null,null,null,{"$f":"SUMIFS(تولید!E:E,تولید!C:C,C439,تولید!D:D,D439)","v":0},null,0]
[null,null,null,null,null,{"$f":"SUMIFS(تولید!E:E,تولید!C:C,C440,تولید!D:D,D440)","v":0},null,0]
[null,null,null,null,null,{"$f":"SUMIFS(تولید!E:E,تولید!C:C,C441,تولید!D:D,D441)","v":0},null,0]
[null,null,null,null,null,{"$f":"SUMIFS(تولید!E:E,تولید!C:C,C442,تولید!D:D,D442)","v":0},null,0]
[null,null,null,null,null,{"$f":"SUMIFS(تولید!E:E,تولید!C:C,C443,تولید!D:D,D443)","v":0},null,0]
[null,null,null,null,null,{"$f":"SUMIFS(تولید!E:E,تولید!C:C,C444,تولید!D:D,D444)","v":0},null,0]
[null,null,null,null,null,{"$f":"SUMIFS(تولید!E:E,تولید!C:C,C445,تولید!D:D,D445)","v":0},null,0]
[null,null,null,null,null,{"$f":"SUMIFS(تولید!E:E,تولید!C:C,C446,تولید!D:D,D446)","v":0},null,0]
[null,null,null,null,null,{"$f":"SUMIFS(تولید!E:E,تولید!C:C,C447,تولید!D:D,D447)","v":0},null,0]
[null,null,null,null,null,{"$f":"SUMIFS(تولید!E:E,تولید!C:C,C448,تولید!D:D,D448)","v":0},null,0]
[null,null,null,null,null,{"$f":"SUMIFS(تولید!E:E,تولید!C:C,C449,تولید!D:D,D449)","v":0},null,0]
[null,null,null,null,null,{"$f":"SUMIFS(تولید!E:E,تولید!C:C,C450,تولید!D:D,D450)","v":0},null,0]
[null,null,null,null,null,{"$f":"SUMIFS(تولید!E:E,تولید!C:C,C451,تولید!D:D,D451)","v":0},null,0]
[null,null,null,null,null,{"$f":"SUMIFS(تولید!E:E,تولید!C:C,C452,تولید!D:D,D452)","v":0},null,0]
[null,null,null,null,null,{"$f":"SUMIFS(تولید!E:E,تولید!C:C,C453,تولید!D:D,D453)","v":0},null,0]
[null,null,null,null,null,{"$f":"SUMIFS(تولید!E:E,تولید!C:C,C454,تولید!D:D,D454)","v":0},null,0]
[null,null,null,null,null,{"$f":"SUMIFS(تولید!E:E,تولید!C:C,C455,تولید!D:D,D455)","v":0},null,{"$f":"IF(E455-F455-G455>=0,E455-F455-G455,E455-F455-(-G455))","v":0}]
[null,null,null,null,null,{"$f":"SUMIFS(تولید!E:E,تولید!C:C,C456,تولید!D:D,D456)","v":0},null,0]
[null,null,null,null,null,{"$f":"SUMIFS(تولید!E:E,تولید!C:C,C457,تولید!D:D,D457)","v":0},null,0]
[null,null,null,null,null,{"$f":"SUMIFS(تولید!E:E,تولید!C:C,C458,تولید!D:D,D458)","v":0},null,0]
[null,null,null,null,null,{"$f":"SUMIFS(تولید!E:E,تولید!C:C,C459,تولید!D:D,D459)","v":0},null,0]
[null,null,null,null,null,{"$f":"SUMIFS(تولید!E:E,تولید!C:C,C460,تولید!D:D,D460)","v":0},null,0]
[null,null,null,null,null,{"$f":"SUMIFS(تولید!E:E,تولید!C:C,C461,تولید!D:D,D461)","v":0},null,0]
[null,null,null,null,null,{"$f":"SUMIFS(تولید!E:E,تولید!C:C,C462,تولید!D:D,D462)","v":0},null,0]
[null,null,null,null,null,{"$f":"SUMIFS(تولید!E:E,تولید!C:C,C463,تولید!D:D,D463)","v":0},null,0]
[null,null,null,null,null,{"$f":"SUMIFS(تولید!E:E,تولید!C:C,C464,تولید!D:D,D464)","v":0},null,0]
[null,null,null,null,null,{"$f":"SUMIFS(تولید!E:E,تولید!C:C,C465,تولید!D:D,D465)","v":0},null,0]
[null,null,null,null,null,{"$f":"SUMIFS(تولید!E:E,تولید!C:C,C466,تولید!D:D,D466)","v":0},null,0]
[null,null,null,null,null,{"$f":"SUMIFS(تولید!E:E,تولید!C:C,C467,تولید!D:D,D467)","v":0},null,0]
[null,null,null,null,null,{"$f":"SUMIFS(تولید!E:E,تولید!C:C,C468,تولید!D:D,D468)","v":0},null,0]
[null,null,null,null,null,{"$f":"SUMIFS(تولید!E:E,تولید!C:C,C469,تولید!D:D,D469)","v":0},null,0]
[null,null,null,null,null,{"$f":"SUMIFS(تولید!E:E,تولید!C:C,C470,تولید!D:D,D470)","v":0},null,0]
[null,null,null,null,null,{"$f":"SUMIFS(تولید!E:E,تولید!C:C,C471,تولید!D:D,D471)","v":0},null,0]
[null,null,null,null,null,{"$f":"SUMIFS(تولید!E:E,تولید!C:C,C472,تولید!D:D,D472)","v":0},null,0]
[null,null,null,null,null,{"$f":"SUMIFS(تولید!E:E,تولید!C:C,C473,تولید!D:D,D473)","v":0},null,0]
[null,null,null,null,null,{"$f":"SUMIFS(تولید!E:E,تولید!C:C,C474,تولید!D:D,D474)","v":0},null,0]
[null,null,null,null,null,{"$f":"SUMIFS(تولید!E:E,تولید!C:C,C475,تولید!D:D,D475)","v":0},null,0]
[null,null,null,null,null,{"$f":"SUMIFS(تولید!E:E,تولید!C:C,C476,تولید!D:D,D476)","v":0},null,0]
[null,null,null,null,null,{"$f":"SUMIFS(تولید!E:E,تولید!C:C,C477,تولید!D:D,D477)","v":0},null,0]
[null,null,null,null,null,{"$f":"SUMIFS(تولید!E:E,تولید!C:C,C478,تولید!D:D,D478)","v":0},null,0]
[null,null,null,null,null,{"$f":"SUMIFS(تولید!E:E,تولید!C:C,C479,تولید!D:D,D479)","v":0},null,0]
[null,null,null,null,null,{"$f":"SUMIFS(تولید!E:E,تولید!C:C,C480,تولید!D:D,D480)","v":0},null,0]
[null,null,null,null,null,{"$f":"SUMIFS(تولید!E:E,تولید!C:C,C481,تولید!D:D,D481)","v":0},null,0]
[null,null,null,null,null,{"$f":"SUMIFS(تولید!E:E,تولید!C:C,C482,تولید!D:D,D482)","v":0},null,0]
[null,null,null,null,null,{"$f":"SUMIFS(تولید!E:E,تولید!C:C,C483,تولید!D:D,D483)","v":0},null,0]
[null,null,null,null,null,{"$f":"SUMIFS(تولید!E:E,تولید!C:C,C484,تولید!D:D,D484)","v":0},null,0]
[null,null,null,null,null,{"$f":"SUMIFS(تولید!E:E,تولید!C:C,C485,تولید!D:D,D485)","v":0},null,0]
[null,null,null,null,null,{"$f":"SUMIFS(تولید!E:E,تولید!C:C,C486,تولید!D:D,D486)","v":0},null,0]
[null,null,null,null,null,{"$f":"SUMIFS(تولید!E:E,تولید!C:C,C487,تولید!D:D,D487)","v":0},null,0]
[null,null,null,null,null,{"$f":"SUMIFS(تولید!E:E,تولید!C:C,C488,تولید!D:D,D488)","v":0},null,0]
[null,null,null,null,null,{"$f":"SUMIFS(تولید!E:E,تولید!C:C,C489,تولید!D:D,D489)","v":0},null,0]
[null,null,null,null,null,{"$f":"SUMIFS(تولید!E:E,تولید!C:C,C490,تولید!D:D,D490)","v":0},null,0]
[null,null,null,null,null,{"$f":"SUMIFS(تولید!E:E,تولید!C:C,C491,تولید!D:D,D491)","v":0},null,0]
[null,null,null,null,null,{"$f":"SUMIFS(تولید!E:E,تولید!C:C,C492,تولید!D:D,D492)","v":0},null,0]
[null,null,null,null,null,{"$f":"SUMIFS(تولید!E:E,تولید!C:C,C493,تولید!D:D,D493)","v":0},null,0]
[null,null,null,null,null,{"$f":"SUMIFS(تولید!E:E,تولید!C:C,C494,تولید!D:D,D494)","v":0},null,0]
[null,null,null,null,null,{"$f":"SUMIFS(تولید!E:E,تولید!C:C,C495,تولید!D:D,D495)","v":0},null,0]
[null,null,null,null,null,{"$f":"SUMIFS(تولید!E:E,تولید!C:C,C496,تولید!D:D,D496)","v":0},null,0]
[null,null,null,null,null,{"$f":"SUMIFS(تولید!E:E,تولید!C:C,C497,تولید!D:D,D497)","v":0},null,0]
[null,null,null,null,null,{"$f":"SUMIFS(تولید!E:E,تولید!C:C,C498,تولید!D:D,D498)","v":0},null,0]
[null,null,null,null,null,{"$f":"SUMIFS(تولید!E:E,تولید!C:C,C499,تولید!D:D,D499)","v":0},null,0]
[null,null,null,null,null,{"$f":"SUMIFS(تولید!E:E,تولید!C:C,C500,تولید!D:D,D500)","v":0},null,0]
[null,null,null,null,null,{"$f":"SUMIFS(تولید!E:E,تولید!C:C,C501,تولید!D:D,D501)","v":0},null,0]
[null,null,null,null,null,{"$f":"SUMIFS(تولید!E:E,تولید!C:C,C502,تولید!D:D,D502)","v":0},null,0]
[null,null,null,null,null,{"$f":"SUMIFS(تولید!E:E,تولید!C:C,C503,تولید!D:D,D503)","v":0},null,0]
[null,null,null,null,null,{"$f":"SUMIFS(تولید!E:E,تولید!C:C,C504,تولید!D:D,D504)","v":0},null,0]
[null,null,null,null,null,{"$f":"SUMIFS(تولید!E:E,تولید!C:C,C505,تولید!D:D,D505)","v":0},null,0]
[null,null,null,null,null,{"$f":"SUMIFS(تولید!E:E,تولید!C:C,C506,تولید!D:D,D506)","v":0},null,0]
[null,null,null,null,null,{"$f":"SUMIFS(تولید!E:E,تولید!C:C,C507,تولید!D:D,D507)","v":0},null,0]
[null,null,null,null,null,{"$f":"SUMIFS(تولید!E:E,تولید!C:C,C508,تولید!D:D,D508)","v":0},null,0]
[null,null,null,null,null,{"$f":"SUMIFS(تولید!E:E,تولید!C:C,C509,تولید!D:D,D509)","v":0},null,0]
[null,null,null,null,null,{"$f":"SUMIFS(تولید!E:E,تولید!C:C,C510,تولید!D:D,D510)","v":0},null,0]
[null,null,null,null,null,{"$f":"SUMIFS(تولید!E:E,تولید!C:C,C511,تولید!D:D,D511)","v":0},null,0]
[null,null,null,null,null,{"$f":"SUMIFS(تولید!E:E,تولید!C:C,C512,تولید!D:D,D512)","v":0},null,0]
[null,null,null,null,null,{"$f":"SUMIFS(تولید!E:E,تولید!C:C,C513,تولید!D:D,D513)","v":0},null,0]
[null,null,null,null,null,{"$f":"SUMIFS(تولید!E:E,تولید!C:C,C514,تولید!D:D,D514)","v":0},null,0]
[null,null,null,null,null,{"$f":"SUMIFS(تولید!E:E,تولید!C:C,C515,تولید!D:D,D515)","v":0},null,0]
[null,null,null,null,null,{"$f":"SUMIFS(تولید!E:E,تولید!C:C,C516,تولید!D:D,D516)","v":0},null,0]
[null,null,null,null,null,{"$f":"SUMIFS(تولید!E:E,تولید!C:C,C517,تولید!D:D,D517)","v":0},null,0]
[null,null,null,null,null,{"$f":"SUMIFS(تولید!E:E,تولید!C:C,C518,تولید!D:D,D518)","v":0},null,0]
[null,null,null,null,null,{"$f":"SUMIFS(تولید!E:E,تولید!C:C,C519,تولید!D:D,D519)","v":0},null,{"$f":"IF(E519-F519-G519>=0,E519-F519-G519,E519-F519-(-G519))","v":0}]
[null,null,null,null,null,{"$f":"SUMIFS(تولید!E:E,تولید!C:C,C520,تولید!D:D,D520)","v":0},null,0]
[null,null,null,null,null,{"$f":"SUMIFS(تولید!E:E,تولید!C:C,C521,تولید!D:D,D521)","v":0},null,0]
[null,null,null,null,null,{"$f":"SUMIFS(تولید!E:E,تولید!C:C,C522,تولید!D:D,D522)","v":0},null,0]
[null,null,null,null,null,{"$f":"SUMIFS(تولید!E:E,تولید!C:C,C523,تولید!D:D,D523)","v":0},null,0]
[null,null,null,null,null,{"$f":"SUMIFS(تولید!E:E,تولید!C:C,C524,تولید!D:D,D524)","v":0},null,0]
[null,null,null,null,null,{"$f":"SUMIFS(تولید!E:E,تولید!C:C,C525,تولید!D:D,D525)","v":0},null,0]
[null,null,null,null,null,{"$f":"SUMIFS(تولید!E:E,تولید!C:C,C526,تولید!D:D,D526)","v":0},null,0]
[null,null,null,null,null,{"$f":"SUMIFS(تولید!E:E,تولید!C:C,C527,تولید!D:D,D527)","v":0},null,0]
[null,null,null,null,null,{"$f":"SUMIFS(تولید!E:E,تولید!C:C,C528,تولید!D:D,D528)","v":0},null,0]
[null,null,null,null,null,{"$f":"SUMIFS(تولید!E:E,تولید!C:C,C529,تولید!D:D,D529)","v":0},null,0]
[null,null,null,null,null,{"$f":"SUMIFS(تولید!E:E,تولید!C:C,C530,تولید!D:D,D530)","v":0},null,0]
[null,null,null,null,null,{"$f":"SUMIFS(تولید!E:E,تولید!C:C,C531,تولید!D:D,D531)","v":0},null,0]
[null,null,null,null,null,{"$f":"SUMIFS(تولید!E:E,تولید!C:C,C532,تولید!D:D,D532)","v":0},null,0]
[null,null,null,null,null,{"$f":"SUMIFS(تولید!E:E,تولید!C:C,C533,تولید!D:D,D533)","v":0},null,0]
[null,null,null,null,null,{"$f":"SUMIFS(تولید!E:E,تولید!C:C,C534,تولید!D:D,D534)","v":0},null,0]
[null,null,null,null,null,{"$f":"SUMIFS(تولید!E:E,تولید!C:C,C535,تولید!D:D,D535)","v":0},null,0]
[null,null,null,null,null,{"$f":"SUMIFS(تولید!E:E,تولید!C:C,C536,تولید!D:D,D536)","v":0},null,0]
[null,null,null,null,null,{"$f":"SUMIFS(تولید!E:E,تولید!C:C,C537,تولید!D:D,D537)","v":0},null,0]
[null,null,null,null,null,{"$f":"SUMIFS(تولید!E:E,تولید!C:C,C538,تولید!D:D,D538)","v":0},null,0]
[null,null,null,null,null,{"$f":"SUMIFS(تولید!E:E,تولید!C:C,C539,تولید!D:D,D539)","v":0},null,0]
[null,null,null,null,null,{"$f":"SUMIFS(تولید!E:E,تولید!C:C,C540,تولید!D:D,D540)","v":0},null,0]
[null,null,null,null,null,{"$f":"SUMIFS(تولید!E:E,تولید!C:C,C541,تولید!D:D,D541)","v":0},null,0]
[null,null,null,null,null,{"$f":"SUMIFS(تولید!E:E,تولید!C:C,C542,تولید!D:D,D542)","v":0},null,0]
[null,null,null,null,null,{"$f":"SUMIFS(تولید!E:E,تولید!C:C,C543,تولید!D:D,D543)","v":0},null,0]
[null,null,null,null,null,{"$f":"SUMIFS(تولید!E:E,تولید!C:C,C544,تولید!D:D,D544)","v":0},null,0]
[null,null,null,null,null,{"$f":"SUMIFS(تولید!E:E,تولید!C:C,C545,تولید!D:D,D545)","v":0},null,0]
[null,null,null,null,null,{"$f":"SUMIFS(تولید!E:E,تولید!C:C,C546,تولید!D:D,D546)","v":0},null,0]
[null,null,null,null,null,{"$f":"SUMIFS(تولید!E:E,تولید!C:C,C547,تولید!D:D,D547)","v":0},null,0]
[null,null,null,null,null,{"$f":"SUMIFS(تولید!E:E,تولید!C:C,C548,تولید!D:D,D548)","v":0},null,0]
[null,null,null,null,null,{"$f":"SUMIFS(تولید!E:E,تولید!C:C,C549,تولید!D:D,D549)","v":0},null,0]
[null,null,null,null,null,{"$f":"SUMIFS(تولید!E:E,تولید!C:C,C550,تولید!D:D,D550)","v":0},null,0]
[null,null,null,null,null,{"$f":"SUMIFS(تولید!E:E,تولید!C:C,C551,تولید!D:D,D551)","v":0},null,0]
[null,null,null,null,null,{"$f":"SUMIFS(تولید!E:E,تولید!C:C,C552,تولید!D:D,D552)","v":0},null,0]
[null,null,null,null,null,{"$f":"SUMIFS(تولید!E:E,تولید!C:C,C553,تولید!D:D,D553)","v":0},null,0]
[null,null,null,null,null,{"$f":"SUMIFS(تولید!E:E,تولید!C:C,C554,تولید!D:D,D554)","v":0},null,0]
[null,null,null,null,null,{"$f":"SUMIFS(تولید!E:E,تولید!C:C,C555,تولید!D:D,D555)","v":0},null,0]
[null,null,null,null,null,{"$f":"SUMIFS(تولید!E:E,تولید!C:C,C556,تولید!D:D,D556)","v":0},null,0]
[null,null,null,null,null,{"$f":"SUMIFS(تولید!E:E,تولید!C:C,C557,تولید!D:D,D557)","v":0},null,0]
[null,null,null,null,null,{"$f":"SUMIFS(تولید!E:E,تولید!C:C,C558,تولید!D:D,D558)","v":0},null,0]
[null,null,null,null,null,{"$f":"SUMIFS(تولید!E:E,تولید!C:C,C559,تولید!D:D,D559)","v":0},null,0]
[null,null,null,null,null,{"$f":"SUMIFS(تولید!E:E,تولید!C:C,C560,تولید!D:D,D560)","v":0},null,0]
[null,null,null,null,null,{"$f":"SUMIFS(تولید!E:E,تولید!C:C,C561,تولید!D:D,D561)","v":0},null,0]
[null,null,null,null,null,{"$f":"SUMIFS(تولید!E:E,تولید!C:C,C562,تولید!D:D,D562)","v":0},null,0]
[null,null,null,null,null,{"$f":"SUMIFS(تولید!E:E,تولید!C:C,C563,تولید!D:D,D563)","v":0},null,0]
[null,null,null,null,null,{"$f":"SUMIFS(تولید!E:E,تولید!C:C,C564,تولید!D:D,D564)","v":0},null,0]
[null,null,null,null,null,{"$f":"SUMIFS(تولید!E:E,تولید!C:C,C565,تولید!D:D,D565)","v":0},null,0]
[null,null,null,null,null,{"$f":"SUMIFS(تولید!E:E,تولید!C:C,C566,تولید!D:D,D566)","v":0},null,0]
[null,null,null,null,null,{"$f":"SUMIFS(تولید!E:E,تولید!C:C,C567,تولید!D:D,D567)","v":0},null,0]
[null,null,null,null,null,{"$f":"SUMIFS(تولید!E:E,تولید!C:C,C568,تولید!D:D,D568)","v":0},null,0]
[null,null,null,null,null,{"$f":"SUMIFS(تولید!E:E,تولید!C:C,C569,تولید!D:D,D569)","v":0},null,0]
[null,null,null,null,null,{"$f":"SUMIFS(تولید!E:E,تولید!C:C,C570,تولید!D:D,D570)","v":0},null,0]
[null,null,null,null,null,{"$f":"SUMIFS(تولید!E:E,تولید!C:C,C571,تولید!D:D,D571)","v":0},null,0]
[null,null,null,null,null,{"$f":"SUMIFS(تولید!E:E,تولید!C:C,C572,تولید!D:D,D572)","v":0},null,0]
[null,null,null,null,null,{"$f":"SUMIFS(تولید!E:E,تولید!C:C,C573,تولید!D:D,D573)","v":0},null,0]
[null,null,null,null,null,{"$f":"SUMIFS(تولید!E:E,تولید!C:C,C574,تولید!D:D,D574)","v":0},null,0]
[null,null,null,null,null,{"$f":"SUMIFS(تولید!E:E,تولید!C:C,C575,تولید!D:D,D575)","v":0},null,0]
[null,null,null,null,null,{"$f":"SUMIFS(تولید!E:E,تولید!C:C,C576,تولید!D:D,D576)","v":0},null,0]
[null,null,null,null,null,{"$f":"SUMIFS(تولید!E:E,تولید!C:C,C577,تولید!D:D,D577)","v":0},null,0]
[null,null,null,null,null,{"$f":"SUMIFS(تولید!E:E,تولید!C:C,C578,تولید!D:D,D578)","v":0},null,0]
[null,null,null,null,null,{"$f":"SUMIFS(تولید!E:E,تولید!C:C,C579,تولید!D:D,D579)","v":0},null,0]
[null,null,null,null,null,{"$f":"SUMIFS(تولید!E:E,تولید!C:C,C580,تولید!D:D,D580)","v":0},null,0]
[null,null,null,null,null,{"$f":"SUMIFS(تولید!E:E,تولید!C:C,C581,تولید!D:D,D581)","v":0},null,0]
[null,null,null,null,null,{"$f":"SUMIFS(تولید!E:E,تولید!C:C,C582,تولید!D:D,D582)","v":0},null,0]
[null,null,null,null,null,{"$f":"SUMIFS(تولید!E:E,تولید!C:C,C583,تولید!D:D,D583)","v":0},null,{"$f":"IF(E583-F583-G583>=0,E583-F583-G583,E583-F583-(-G583))","v":0}]
[null,null,null,null,null,{"$f":"SUMIFS(تولید!E:E,تولید!C:C,C584,تولید!D:D,D584)","v":0},null,0]
[null,null,null,null,null,{"$f":"SUMIFS(تولید!E:E,تولید!C:C,C585,تولید!D:D,D585)","v":0},null,0]
[null,null,null,null,null,{"$f":"SUMIFS(تولید!E:E,تولید!C:C,C586,تولید!D:D,D586)","v":0},null,0]
[null,null,null,null,null,{"$f":"SUMIFS(تولید!E:E,تولید!C:C,C587,تولید!D:D,D587)","v":0},null,0]
[null,null,null,null,null,{"$f":"SUMIFS(تولید!E:E,تولید!C:C,C588,تولید!D:D,D588)","v":0},null,0]
[null,null,null,null,null,{"$f":"SUMIFS(تولید!E:E,تولید!C:C,C589,تولید!D:D,D589)","v":0},null,0]
[null,null,null,null,null,{"$f":"SUMIFS(تولید!E:E,تولید!C:C,C590,تولید!D:D,D590)","v":0},null,0]
[null,null,null,null,null,{"$f":"SUMIFS(تولید!E:E,تولید!C:C,C591,تولید!D:D,D591)","v":0},null,0]
[null,null,null,null,null,{"$f":"SUMIFS(تولید!E:E,تولید!C:C,C592,تولید!D:D,D592)","v":0},null,0]
[null,null,null,null,null,{"$f":"SUMIFS(تولید!E:E,تولید!C:C,C593,تولید!D:D,D593)","v":0},null,0]
[null,null,null,null,null,{"$f":"SUMIFS(تولید!E:E,تولید!C:C,C594,تولید!D:D,D594)","v":0},null,0]
[null,null,null,null,null,{"$f":"SUMIFS(تولید!E:E,تولید!C:C,C595,تولید!D:D,D595)","v":0},null,0]
[null,null,null,null,null,{"$f":"SUMIFS(تولید!E:E,تولید!C:C,C596,تولید!D:D,D596)","v":0},null,0]
[null,null,null,null,null,{"$f":"SUMIFS(تولید!E:E,تولید!C:C,C597,تولید!D:D,D597)","v":0},null,0]
[null,null,null,null,null,{"$f":"SUMIFS(تولید!E:E,تولید!C:C,C598,تولید!D:D,D598)","v":0},null,0]
[null,null,null,null,null,{"$f":"SUMIFS(تولید!E:E,تولید!C:C,C599,تولید!D:D,D599)","v":0},null,0]
[null,null,null,null,null,{"$f":"SUMIFS(تولید!E:E,تولید!C:C,C600,تولید!D:D,D600)","v":0},null,0]
[null,null,null,null,null,{"$f":"SUMIFS(تولید!E:E,تولید!C:C,C601,تولید!D:D,D601)","v":0},null,0]
[null,null,null,null,null,{"$f":"SUMIFS(تولید!E:E,تولید!C:C,C602,تولید!D:D,D602)","v":0},null,0]
[null,null,null,null,null,{"$f":"SUMIFS(تولید!E:E,تولید!C:C,C603,تولید!D:D,D603)","v":0},null,0]
[null,null,null,null,null,{"$f":"SUMIFS(تولید!E:E,تولید!C:C,C604,تولید!D:D,D604)","v":0},null,0]
[null,null,null,null,null,{"$f":"SUMIFS(تولید!E:E,تولید!C:C,C605,تولید!D:D,D605)","v":0},null,0]
[null,null,null,null,null,{"$f":"SUMIFS(تولید!E:E,تولید!C:C,C606,تولید!D:D,D606)","v":0},null,0]
[null,null,null,null,null,{"$f":"SUMIFS(تولید!E:E,تولید!C:C,C607,تولید!D:D,D607)","v":0},null,0]
[null,null,null,null,null,{"$f":"SUMIFS(تولید!E:E,تولید!C:C,C608,تولید!D:D,D608)","v":0},null,0]
[null,null,null,null,null,{"$f":"SUMIFS(تولید!E:E,تولید!C:C,C609,تولید!D:D,D609)","v":0},null,0]
[null,null,null,null,null,{"$f":"SUMIFS(تولید!E:E,تولید!C:C,C610,تولید!D:D,D610)","v":0},null,0]
[null,null,null,null,null,{"$f":"SUMIFS(تولید!E:E,تولید!C:C,C611,تولید!D:D,D611)","v":0},null,0]
[null,null,null,null,null,{"$f":"SUMIFS(تولید!E:E,تولید!C:C,C612,تولید!D:D,D612)","v":0},null,0]
[null,null,null,null,null,{"$f":"SUMIFS(تولید!E:E,تولید!C:C,C613,تولید!D:D,D613)","v":0},null,0]
[null,null,null,null,null,{"$f":"SUMIFS(تولید!E:E,تولید!C:C,C614,تولید!D:D,D614)","v":0},null,0]
[null,null,null,null,null,{"$f":"SUMIFS(تولید!E:E,تولید!C:C,C615,تولید!D:D,D615)","v":0},null,0]
[null,null,null,null,null,{"$f":"SUMIFS(تولید!E:E,تولید!C:C,C616,تولید!D:D,D616)","v":0},null,0]
[null,null,null,null,null,{"$f":"SUMIFS(تولید!E:E,تولید!C:C,C617,تولید!D:D,D617)","v":0},null,0]
[null,null,null,null,null,{"$f":"SUMIFS(تولید!E:E,تولید!C:C,C618,تولید!D:D,D618)","v":0},null,0]
[null,null,null,null,null,{"$f":"SUMIFS(تولید!E:E,تولید!C:C,C619,تولید!D:D,D619)","v":0},null,0]
[null,null,null,null,null,{"$f":"SUMIFS(تولید!E:E,تولید!C:C,C620,تولید!D:D,D620)","v":0},null,0]
[null,null,null,null,null,{"$f":"SUMIFS(تولید!E:E,تولید!C:C,C621,تولید!D:D,D621)","v":0},null,0]
[null,null,null,null,null,{"$f":"SUMIFS(تولید!E:E,تولید!C:C,C622,تولید!D:D,D622)","v":0},null,0]
[null,null,null,null,null,{"$f":"SUMIFS(تولید!E:E,تولید!C:C,C623,تولید!D:D,D623)","v":0},null,0]
[null,null,null,null,null,{"$f":"SUMIFS(تولید!E:E,تولید!C:C,C624,تولید!D:D,D624)","v":0},null,0]
[null,null,null,null,null,{"$f":"SUMIFS(تولید!E:E,تولید!C:C,C625,تولید!D:D,D625)","v":0},null,0]

{"sheet":"مانده سفارش","index":2,"n_rows":500,"n_cols":7,"rows_kept":500,"cut":false,"hidden":false,"merged":[[0,0,0,3],[1,0,1,6],[0,4,0,6]]}
["مانده سفارشات تا آخرین تاریخ تولید :",null,null,null,{"$f":"INDIRECT(\"تولید!B\"&COUNTA(تولید!B:B))","v":"1393/01/09"}]
[]
["ردیف","شماره دستور ساخت","تاریخ سفارش","نام محصول","مقدار سفارش","تولید","مانده"]
[{"$f":"IF(C4=\"\",\"\",ROW()-ROW($A$3))","v":1},{"$f":"IF(سفارشات!H11<>0,سفارشات!C11,\"\")","v":"15-010"},{"$f":"IF(سفارشات!H11<>0,سفارشات!B11,\"\")","v":"1393/01/11"},{"$f":"IF(سفارشات!H11<>0,سفارشات!D11,\"\")","v":"J"},{"$f":"IF(سفارشات!H11<>0,سفارشات!E11,\"\")","v":320},{"$f":"IF(سفارشات!H11<>0,سفارشات!F11,\"\")","v":0},{"$f":"IF(C4=\"\",\"\",E4-F4)","v":320}]
[{"$f":"IF(C5=\"\",\"\",ROW()-ROW($A$3))","v":2},{"$f":"IF(سفارشات!H10<>0,سفارشات!C10,\"\")","v":"15-009"},{"$f":"IF(سفارشات!H10<>0,سفارشات!B10,\"\")","v":"1393/01/10"},{"$f":"IF(سفارشات!H10<>0,سفارشات!D10,\"\")","v":"I"},{"$f":"IF(سفارشات!H10<>0,سفارشات!E10,\"\")","v":150},{"$f":"IF(سفارشات!H10<>0,سفارشات!F10,\"\")","v":0},{"$f":"IF(C5=\"\",\"\",E5-F5)","v":150}]
[{"$f":"IF(C6=\"\",\"\",ROW()-ROW($A$3))","v":3},{"$f":"IF(سفارشات!H9<>0,سفارشات!C9,\"\")","v":"15-008"},{"$f":"IF(سفارشات!H9<>0,سفارشات!B9,\"\")","v":"1393/01/09"},{"$f":"IF(سفارشات!H9<>0,سفارشات!D9,\"\")","v":"H"},{"$f":"IF(سفارشات!H9<>0,سفارشات!E9,\"\")","v":420},{"$f":"IF(سفارشات!H9<>0,سفارشات!F9,\"\")","v":0},{"$f":"IF(C6=\"\",\"\",E6-F6)","v":420}]
[{"$f":"IF(C7=\"\",\"\",ROW()-ROW($A$3))","v":4},{"$f":"IF(سفارشات!H8<>0,سفارشات!C8,\"\")","v":"15-007"},{"$f":"IF(سفارشات!H8<>0,سفارشات!B8,\"\")","v":"1393/01/08"},{"$f":"IF(سفارشات!H8<>0,سفارشات!D8,\"\")","v":"G"},{"$f":"IF(سفارشات!H8<>0,سفارشات!E8,\"\")","v":570},{"$f":"IF(سفارشات!H8<>0,سفارشات!F8,\"\")","v":0},{"$f":"IF(C7=\"\",\"\",E7-F7)","v":570}]
[{"$f":"IF(C8=\"\",\"\",ROW()-ROW($A$3))","v":5},{"$f":"IF(سفارشات!H7<>0,سفارشات!C7,\"\")","v":"15-006"},{"$f":"IF(سفارشات!H7<>0,سفارشات!B7,\"\")","v":"1393/01/07"},{"$f":"IF(سفارشات!H7<>0,سفارشات!D7,\"\")","v":"F"},{"$f":"IF(سفارشات!H7<>0,سفارشات!E7,\"\")","v":700},{"$f":"IF(سفارشات!H7<>0,سفارشات!F7,\"\")","v":0},{"$f":"IF(C8=\"\",\"\",E8-F8)","v":700}]
[{"$f":"IF(C9=\"\",\"\",ROW()-ROW($A$3))","v":6},{"$f":"IF(سفارشات!H5<>0,سفارشات!C5,\"\")","v":"15-004"},{"$f":"IF(سفارشات!H5<>0,سفارشات!B5,\"\")","v":"1393/01/05"},{"$f":"IF(سفارشات!H5<>0,سفارشات!D5,\"\")","v":"D"},{"$f":"IF(سفارشات!H5<>0,سفارشات!E5,\"\")","v":200},{"$f":"IF(سفارشات!H5<>0,سفارشات!F5,\"\")","v":185},{"$f":"IF(C9=\"\",\"\",E9-F9)","v":15}]
[{"$f":"IF(C10=\"\",\"\",ROW()-ROW($A$3))","v":7},{"$f":"IF(سفارشات!H3<>0,سفارشات!C3,\"\")","v":"15-002"},{"$f":"IF(سفارشات!H3<>0,سفارشات!B3,\"\")","v":"1393/01/03"},{"$f":"IF(سفارشات!H3<>0,سفارشات!D3,\"\")","v":"B"},{"$f":"IF(سفارشات!H3<>0,سفارشات!E3,\"\")","v":542},{"$f":"IF(سفارشات!H3<>0,سفارشات!F3,\"\")","v":200},{"$f":"IF(C10=\"\",\"\",E10-F10)","v":342}]
[{"$f":"IF(C11=\"\",\"\",ROW()-ROW($A$3))","v":""},{"$f":"IF(سفارشات!H12<>0,سفارشات!C12,\"\")","v":""},{"$f":"IF(سفارشات!H12<>0,سفارشات!B12,\"\")","v":""},{"$f":"IF(سفارشات!H12<>0,سفارشات!D12,\"\")","v":""},{"$f":"IF(سفارشات!H12<>0,سفارشات!E12,\"\")","v":""},{"$f":"IF(سفارشات!H12<>0,سفارشات!F12,\"\")","v":""},{"$f":"IF(C11=\"\",\"\",E11-F11)","v":""}]
[{"$f":"IF(C12=\"\",\"\",ROW()-ROW($A$3))","v":""},{"$f":"IF(سفارشات!H2<>0,سفارشات!C2,\"\")","v":""},{"$f":"IF(سفارشات!H2<>0,سفارشات!B2,\"\")","v":""},{"$f":"IF(سفارشات!H2<>0,سفارشات!D2,\"\")","v":""},{"$f":"IF(سفارشات!H2<>0,سفارشات!E2,\"\")","v":""},{"$f":"IF(سفارشات!H2<>0,سفارشات!F2,\"\")","v":""},{"$f":"IF(C12=\"\",\"\",E12-F12)","v":""}]
[{"$f":"IF(C13=\"\",\"\",ROW()-ROW($A$3))","v":""},{"$f":"IF(سفارشات!H4<>0,سفارشات!C4,\"\")","v":""},{"$f":"IF(سفارشات!H4<>0,سفارشات!B4,\"\")","v":""},{"$f":"IF(سفارشات!H4<>0,سفارشات!D4,\"\")","v":""},{"$f":"IF(سفارشات!H4<>0,سفارشات!E4,\"\")","v":""},{"$f":"IF(سفارشات!H4<>0,سفارشات!F4,\"\")","v":""},{"$f":"IF(C13=\"\",\"\",E13-F13)","v":""}]
[{"$f":"IF(C14=\"\",\"\",ROW()-ROW($A$3))","v":""},{"$f":"IF(سفارشات!H6<>0,سفارشات!C6,\"\")","v":""},{"$f":"IF(سفارشات!H6<>0,سفارشات!B6,\"\")","v":""},{"$f":"IF(سفارشات!H6<>0,سفارشات!D6,\"\")","v":""},{"$f":"IF(سفارشات!H6<>0,سفارشات!E6,\"\")","v":""},{"$f":"IF(سفارشات!H6<>0,سفارشات!F6,\"\")","v":""},{"$f":"IF(C14=\"\",\"\",E14-F14)","v":""}]
[{"$f":"IF(C15=\"\",\"\",ROW()-ROW($A$3))","v":""},{"$f":"IF(سفارشات!H13<>0,سفارشات!C13,\"\")","v":""},{"$f":"IF(سفارشات!H13<>0,سفارشات!B13,\"\")","v":""},{"$f":"IF(سفارشات!H13<>0,سفارشات!D13,\"\")","v":""},{"$f":"IF(سفارشات!H13<>0,سفارشات!E13,\"\")","v":""},{"$f":"IF(سفارشات!H13<>0,سفارشات!F13,\"\")","v":""},{"$f":"IF(C15=\"\",\"\",E15-F15)","v":""}]
[{"$f":"IF(C16=\"\",\"\",ROW()-ROW($A$3))","v":""},{"$f":"IF(سفارشات!H14<>0,سفارشات!C14,\"\")","v":""},{"$f":"IF(سفارشات!H14<>0,سفارشات!B14,\"\")","v":""},{"$f":"IF(سفارشات!H14<>0,سفارشات!D14,\"\")","v":""},{"$f":"IF(سفارشات!H14<>0,سفارشات!E14,\"\")","v":""},{"$f":"IF(سفارشات!H14<>0,سفارشات!F14,\"\")","v":""},{"$f":"IF(C16=\"\",\"\",E16-F16)","v":""}]
[{"$f":"IF(C17=\"\",\"\",ROW()-ROW($A$3))","v":""},{"$f":"IF(سفارشات!H15<>0,سفارشات!C15,\"\")","v":""},{"$f":"IF(سفارشات!H15<>0,سفارشات!B15,\"\")","v":""},{"$f":"IF(سفارشات!H15<>0,سفارشات!D15,\"\")","v":""},{"$f":"IF(سفارشات!H15<>0,سفارشات!E15,\"\")","v":""},{"$f":"IF(سفارشات!H15<>0,سفارشات!F15,\"\")","v":""},{"$f":"IF(C17=\"\",\"\",E17-F17)","v":""}]
[{"$f":"IF(C18=\"\",\"\",ROW()-ROW($A$3))","v":""},{"$f":"IF(سفارشات!H16<>0,سفارشات!C16,\"\")","v":""},{"$f":"IF(سفارشات!H16<>0,سفارشات!B16,\"\")","v":""},{"$f":"IF(سفارشات!H16<>0,سفارشات!D16,\"\")","v":""},{"$f":"IF(سفارشات!H16<>0,سفارشات!E16,\"\")","v":""},{"$f":"IF(سفارشات!H16<>0,سفارشات!F16,\"\")","v":""},{"$f":"IF(C18=\"\",\"\",E18-F18)","v":""}]
[{"$f":"IF(C19=\"\",\"\",ROW()-ROW($A$3))","v":""},{"$f":"IF(سفارشات!H17<>0,سفارشات!C17,\"\")","v":""},{"$f":"IF(سفارشات!H17<>0,سفارشات!B17,\"\")","v":""},{"$f":"IF(سفارشات!H17<>0,سفارشات!D17,\"\")","v":""},{"$f":"IF(سفارشات!H17<>0,سفارشات!E17,\"\")","v":""},{"$f":"IF(سفارشات!H17<>0,سفارشات!F17,\"\")","v":""},{"$f":"IF(C19=\"\",\"\",E19-F19)","v":""}]
[{"$f":"IF(C20=\"\",\"\",ROW()-ROW($A$3))","v":""},{"$f":"IF(سفارشات!H18<>0,سفارشات!C18,\"\")","v":""},{"$f":"IF(سفارشات!H18<>0,سفارشات!B18,\"\")","v":""},{"$f":"IF(سفارشات!H18<>0,سفارشات!D18,\"\")","v":""},{"$f":"IF(سفارشات!H18<>0,سفارشات!E18,\"\")","v":""},{"$f":"IF(سفارشات!H18<>0,سفارشات!F18,\"\")","v":""},{"$f":"IF(C20=\"\",\"\",E20-F20)","v":""}]
[{"$f":"IF(C21=\"\",\"\",ROW()-ROW($A$3))","v":""},{"$f":"IF(سفارشات!H19<>0,سفارشات!C19,\"\")","v":""},{"$f":"IF(سفارشات!H19<>0,سفارشات!B19,\"\")","v":""},{"$f":"IF(سفارشات!H19<>0,سفارشات!D19,\"\")","v":""},{"$f":"IF(سفارشات!H19<>0,سفارشات!E19,\"\")","v":""},{"$f":"IF(سفارشات!H19<>0,سفارشات!F19,\"\")","v":""},{"$f":"IF(C21=\"\",\"\",E21-F21)","v":""}]
[{"$f":"IF(C22=\"\",\"\",ROW()-ROW($A$3))","v":""},{"$f":"IF(سفارشات!H20<>0,سفارشات!C20,\"\")","v":""},{"$f":"IF(سفارشات!H20<>0,سفارشات!B20,\"\")","v":""},{"$f":"IF(سفارشات!H20<>0,سفارشات!D20,\"\")","v":""},{"$f":"IF(سفارشات!H20<>0,سفارشات!E20,\"\")","v":""},{"$f":"IF(سفارشات!H20<>0,سفارشات!F20,\"\")","v":""},{"$f":"IF(C22=\"\",\"\",E22-F22)","v":""}]
[{"$f":"IF(C23=\"\",\"\",ROW()-ROW($A$3))","v":""},{"$f":"IF(سفارشات!H21<>0,سفارشات!C21,\"\")","v":""},{"$f":"IF(سفارشات!H21<>0,سفارشات!B21,\"\")","v":""},{"$f":"IF(سفارشات!H21<>0,سفارشات!D21,\"\")","v":""},{"$f":"IF(سفارشات!H21<>0,سفارشات!E21,\"\")","v":""},{"$f":"IF(سفارشات!H21<>0,سفارشات!F21,\"\")","v":""},{"$f":"IF(C23=\"\",\"\",E23-F23)","v":""}]
[{"$f":"IF(C24=\"\",\"\",ROW()-ROW($A$3))","v":""},{"$f":"IF(سفارشات!H22<>0,سفارشات!C22,\"\")","v":""},{"$f":"IF(سفارشات!H22<>0,سفارشات!B22,\"\")","v":""},{"$f":"IF(سفارشات!H22<>0,سفارشات!D22,\"\")","v":""},{"$f":"IF(سفارشات!H22<>0,سفارشات!E22,\"\")","v":""},{"$f":"IF(سفارشات!H22<>0,سفارشات!F22,\"\")","v":""},{"$f":"IF(C24=\"\",\"\",E24-F24)","v":""}]
[{"$f":"IF(C25=\"\",\"\",ROW()-ROW($A$3))","v":""},{"$f":"IF(سفارشات!H23<>0,سفارشات!C23,\"\")","v":""},{"$f":"IF(سفارشات!H23<>0,سفارشات!B23,\"\")","v":""},{"$f":"IF(سفارشات!H23<>0,سفارشات!D23,\"\")","v":""},{"$f":"IF(سفارشات!H23<>0,سفارشات!E23,\"\")","v":""},{"$f":"IF(سفارشات!H23<>0,سفارشات!F23,\"\")","v":""},{"$f":"IF(C25=\"\",\"\",E25-F25)","v":""}]
[{"$f":"IF(C26=\"\",\"\",ROW()-ROW($A$3))","v":""},{"$f":"IF(سفارشات!H24<>0,سفارشات!C24,\"\")","v":""},{"$f":"IF(سفارشات!H24<>0,سفارشات!B24,\"\")","v":""},{"$f":"IF(سفارشات!H24<>0,سفارشات!D24,\"\")","v":""},{"$f":"IF(سفارشات!H24<>0,سفارشات!E24,\"\")","v":""},{"$f":"IF(سفارشات!H24<>0,سفارشات!F24,\"\")","v":""},{"$f":"IF(C26=\"\",\"\",E26-F26)","v":""}]
[{"$f":"IF(C27=\"\",\"\",ROW()-ROW($A$3))","v":""},{"$f":"IF(سفارشات!H25<>0,سفارشات!C25,\"\")","v":""},{"$f":"IF(سفارشات!H25<>0,سفارشات!B25,\"\")","v":""},{"$f":"IF(سفارشات!H25<>0,سفارشات!D25,\"\")","v":""},{"$f":"IF(سفارشات!H25<>0,سفارشات!E25,\"\")","v":""},{"$f":"IF(سفارشات!H25<>0,سفارشات!F25,\"\")","v":""},{"$f":"IF(C27=\"\",\"\",E27-F27)","v":""}]
[{"$f":"IF(C28=\"\",\"\",ROW()-ROW($A$3))","v":""},{"$f":"IF(سفارشات!H26<>0,سفارشات!C26,\"\")","v":""},{"$f":"IF(سفارشات!H26<>0,سفارشات!B26,\"\")","v":""},{"$f":"IF(سفارشات!H26<>0,سفارشات!D26,\"\")","v":""},{"$f":"IF(سفارشات!H26<>0,سفارشات!E26,\"\")","v":""},{"$f":"IF(سفارشات!H26<>0,سفارشات!F26,\"\")","v":""},{"$f":"IF(C28=\"\",\"\",E28-F28)","v":""}]
[{"$f":"IF(C29=\"\",\"\",ROW()-ROW($A$3))","v":""},{"$f":"IF(سفارشات!H27<>0,سفارشات!C27,\"\")","v":""},{"$f":"IF(سفارشات!H27<>0,سفارشات!B27,\"\")","v":""},{"$f":"IF(سفارشات!H27<>0,سفارشات!D27,\"\")","v":""},{"$f":"IF(سفارشات!H27<>0,سفارشات!E27,\"\")","v":""},{"$f":"IF(سفارشات!H27<>0,سفارشات!F27,\"\")","v":""},{"$f":"IF(C29=\"\",\"\",E29-F29)","v":""}]
[{"$f":"IF(C30=\"\",\"\",ROW()-ROW($A$3))","v":""},{"$f":"IF(سفارشات!H28<>0,سفارشات!C28,\"\")","v":""},{"$f":"IF(سفارشات!H28<>0,سفارشات!B28,\"\")","v":""},{"$f":"IF(سفارشات!H28<>0,سفارشات!D28,\"\")","v":""},{"$f":"IF(سفارشات!H28<>0,سفارشات!E28,\"\")","v":""},{"$f":"IF(سفارشات!H28<>0,سفارشات!F28,\"\")","v":""},{"$f":"IF(C30=\"\",\"\",E30-F30)","v":""}]
[{"$f":"IF(C31=\"\",\"\",ROW()-ROW($A$3))","v":""},{"$f":"IF(سفارشات!H29<>0,سفارشات!C29,\"\")","v":""},{"$f":"IF(سفارشات!H29<>0,سفارشات!B29,\"\")","v":""},{"$f":"IF(سفارشات!H29<>0,سفارشات!D29,\"\")","v":""},{"$f":"IF(سفارشات!H29<>0,سفارشات!E29,\"\")","v":""},{"$f":"IF(سفارشات!H29<>0,سفارشات!F29,\"\")","v":""},{"$f":"IF(C31=\"\",\"\",E31-F31)","v":""}]
[{"$f":"IF(C32=\"\",\"\",ROW()-ROW($A$3))","v":""},{"$f":"IF(سفارشات!H30<>0,سفارشات!C30,\"\")","v":""},{"$f":"IF(سفارشات!H30<>0,سفارشات!B30,\"\")","v":""},{"$f":"IF(سفارشات!H30<>0,سفارشات!D30,\"\")","v":""},{"$f":"IF(سفارشات!H30<>0,سفارشات!E30,\"\")","v":""},{"$f":"IF(سفارشات!H30<>0,سفارشات!F30,\"\")","v":""},{"$f":"IF(C32=\"\",\"\",E32-F32)","v":""}]
[{"$f":"IF(C33=\"\",\"\",ROW()-ROW($A$3))","v":""},{"$f":"IF(سفارشات!H31<>0,سفارشات!C31,\"\")","v":""},{"$f":"IF(سفارشات!H31<>0,سفارشات!B31,\"\")","v":""},{"$f":"IF(سفارشات!H31<>0,سفارشات!D31,\"\")","v":""},{"$f":"IF(سفارشات!H31<>0,سفارشات!E31,\"\")","v":""},{"$f":"IF(سفارشات!H31<>0,سفارشات!F31,\"\")","v":""},{"$f":"IF(C33=\"\",\"\",E33-F33)","v":""}]
[{"$f":"IF(C34=\"\",\"\",ROW()-ROW($A$3))","v":""},{"$f":"IF(سفارشات!H32<>0,سفارشات!C32,\"\")","v":""},{"$f":"IF(سفارشات!H32<>0,سفارشات!B32,\"\")","v":""},{"$f":"IF(سفارشات!H32<>0,سفارشات!D32,\"\")","v":""},{"$f":"IF(سفارشات!H32<>0,سفارشات!E32,\"\")","v":""},{"$f":"IF(سفارشات!H32<>0,سفارشات!F32,\"\")","v":""},{"$f":"IF(C34=\"\",\"\",E34-F34)","v":""}]
[{"$f":"IF(C35=\"\",\"\",ROW()-ROW($A$3))","v":""},{"$f":"IF(سفارشات!H33<>0,سفارشات!C33,\"\")","v":""},{"$f":"IF(سفارشات!H33<>0,سفارشات!B33,\"\")","v":""},{"$f":"IF(سفارشات!H33<>0,سفارشات!D33,\"\")","v":""},{"$f":"IF(سفارشات!H33<>0,سفارشات!E33,\"\")","v":""},{"$f":"IF(سفارشات!H33<>0,سفارشات!F33,\"\")","v":""},{"$f":"IF(C35=\"\",\"\",E35-F35)","v":""}]
[{"$f":"IF(C36=\"\",\"\",ROW()-ROW($A$3))","v":""},{"$f":"IF(سفارشات!H34<>0,سفارشات!C34,\"\")","v":""},{"$f":"IF(سفارشات!H34<>0,سفارشات!B34,\"\")","v":""},{"$f":"IF(سفارشات!H34<>0,سفارشات!D34,\"\")","v":""},{"$f":"IF(سفارشات!H34<>0,سفارشات!E34,\"\")","v":""},{"$f":"IF(سفارشات!H34<>0,سفارشات!F34,\"\")","v":""},{"$f":"IF(C36=\"\",\"\",E36-F36)","v":""}]
[{"$f":"IF(C37=\"\",\"\",ROW()-ROW($A$3))","v":""},{"$f":"IF(سفارشات!H35<>0,سفارشات!C35,\"\")","v":""},{"$f":"IF(سفارشات!H35<>0,سفارشات!B35,\"\")","v":""},{"$f":"IF(سفارشات!H35<>0,سفارشات!D35,\"\")","v":""},{"$f":"IF(سفارشات!H35<>0,سفارشات!E35,\"\")","v":""},{"$f":"IF(سفارشات!H35<>0,سفارشات!F35,\"\")","v":""},{"$f":"IF(C37=\"\",\"\",E37-F37)","v":""}]
[{"$f":"IF(C38=\"\",\"\",ROW()-ROW($A$3))","v":""},{"$f":"IF(سفارشات!H36<>0,سفارشات!C36,\"\")","v":""},{"$f":"IF(سفارشات!H36<>0,سفارشات!B36,\"\")","v":""},{"$f":"IF(سفارشات!H36<>0,سفارشات!D36,\"\")","v":""},{"$f":"IF(سفارشات!H36<>0,سفارشات!E36,\"\")","v":""},{"$f":"IF(سفارشات!H36<>0,سفارشات!F36,\"\")","v":""},{"$f":"IF(C38=\"\",\"\",E38-F38)","v":""}]
[{"$f":"IF(C39=\"\",\"\",ROW()-ROW($A$3))","v":""},{"$f":"IF(سفارشات!H37<>0,سفارشات!C37,\"\")","v":""},{"$f":"IF(سفارشات!H37<>0,سفارشات!B37,\"\")","v":""},{"$f":"IF(سفارشات!H37<>0,سفارشات!D37,\"\")","v":""},{"$f":"IF(سفارشات!H37<>0,سفارشات!E37,\"\")","v":""},{"$f":"IF(سفارشات!H37<>0,سفارشات!F37,\"\")","v":""},{"$f":"IF(C39=\"\",\"\",E39-F39)","v":""}]
[{"$f":"IF(C40=\"\",\"\",ROW()-ROW($A$3))","v":""},{"$f":"IF(سفارشات!H38<>0,سفارشات!C38,\"\")","v":""},{"$f":"IF(سفارشات!H38<>0,سفارشات!B38,\"\")","v":""},{"$f":"IF(سفارشات!H38<>0,سفارشات!D38,\"\")","v":""},{"$f":"IF(سفارشات!H38<>0,سفارشات!E38,\"\")","v":""},{"$f":"IF(سفارشات!H38<>0,سفارشات!F38,\"\")","v":""},{"$f":"IF(C40=\"\",\"\",E40-F40)","v":""}]
[{"$f":"IF(C41=\"\",\"\",ROW()-ROW($A$3))","v":""},{"$f":"IF(سفارشات!H39<>0,سفارشات!C39,\"\")","v":""},{"$f":"IF(سفارشات!H39<>0,سفارشات!B39,\"\")","v":""},{"$f":"IF(سفارشات!H39<>0,سفارشات!D39,\"\")","v":""},{"$f":"IF(سفارشات!H39<>0,سفارشات!E39,\"\")","v":""},{"$f":"IF(سفارشات!H39<>0,سفارشات!F39,\"\")","v":""},{"$f":"IF(C41=\"\",\"\",E41-F41)","v":""}]
[{"$f":"IF(C42=\"\",\"\",ROW()-ROW($A$3))","v":""},{"$f":"IF(سفارشات!H40<>0,سفارشات!C40,\"\")","v":""},{"$f":"IF(سفارشات!H40<>0,سفارشات!B40,\"\")","v":""},{"$f":"IF(سفارشات!H40<>0,سفارشات!D40,\"\")","v":""},{"$f":"IF(سفارشات!H40<>0,سفارشات!E40,\"\")","v":""},{"$f":"IF(سفارشات!H40<>0,سفارشات!F40,\"\")","v":""},{"$f":"IF(C42=\"\",\"\",E42-F42)","v":""}]
[{"$f":"IF(C43=\"\",\"\",ROW()-ROW($A$3))","v":""},{"$f":"IF(سفارشات!H41<>0,سفارشات!C41,\"\")","v":""},{"$f":"IF(سفارشات!H41<>0,سفارشات!B41,\"\")","v":""},{"$f":"IF(سفارشات!H41<>0,سفارشات!D41,\"\")","v":""},{"$f":"IF(سفارشات!H41<>0,سفارشات!E41,\"\")","v":""},{"$f":"IF(سفارشات!H41<>0,سفارشات!F41,\"\")","v":""},{"$f":"IF(C43=\"\",\"\",E43-F43)","v":""}]
[{"$f":"IF(C44=\"\",\"\",ROW()-ROW($A$3))","v":""},{"$f":"IF(سفارشات!H42<>0,سفارشات!C42,\"\")","v":""},{"$f":"IF(سفارشات!H42<>0,سفارشات!B42,\"\")","v":""},{"$f":"IF(سفارشات!H42<>0,سفارشات!D42,\"\")","v":""},{"$f":"IF(سفارشات!H42<>0,سفارشات!E42,\"\")","v":""},{"$f":"IF(سفارشات!H42<>0,سفارشات!F42,\"\")","v":""},{"$f":"IF(C44=\"\",\"\",E44-F44)","v":""}]
[{"$f":"IF(C45=\"\",\"\",ROW()-ROW($A$3))","v":""},{"$f":"IF(سفارشات!H43<>0,سفارشات!C43,\"\")","v":""},{"$f":"IF(سفارشات!H43<>0,سفارشات!B43,\"\")","v":""},{"$f":"IF(سفارشات!H43<>0,سفارشات!D43,\"\")","v":""},{"$f":"IF(سفارشات!H43<>0,سفارشات!E43,\"\")","v":""},{"$f":"IF(سفارشات!H43<>0,سفارشات!F43,\"\")","v":""},{"$f":"IF(C45=\"\",\"\",E45-F45)","v":""}]
[{"$f":"IF(C46=\"\",\"\",ROW()-ROW($A$3))","v":""},{"$f":"IF(سفارشات!H44<>0,سفارشات!C44,\"\")","v":""},{"$f":"IF(سفارشات!H44<>0,سفارشات!B44,\"\")","v":""},{"$f":"IF(سفارشات!H44<>0,سفارشات!D44,\"\")","v":""},{"$f":"IF(سفارشات!H44<>0,سفارشات!E44,\"\")","v":""},{"$f":"IF(سفارشات!H44<>0,سفارشات!F44,\"\")","v":""},{"$f":"IF(C46=\"\",\"\",E46-F46)","v":""}]
[{"$f":"IF(C47=\"\",\"\",ROW()-ROW($A$3))","v":""},{"$f":"IF(سفارشات!H45<>0,سفارشات!C45,\"\")","v":""},{"$f":"IF(سفارشات!H45<>0,سفارشات!B45,\"\")","v":""},{"$f":"IF(سفارشات!H45<>0,سفارشات!D45,\"\")","v":""},{"$f":"IF(سفارشات!H45<>0,سفارشات!E45,\"\")","v":""},{"$f":"IF(سفارشات!H45<>0,سفارشات!F45,\"\")","v":""},{"$f":"IF(C47=\"\",\"\",E47-F47)","v":""}]
[{"$f":"IF(C48=\"\",\"\",ROW()-ROW($A$3))","v":""},{"$f":"IF(سفارشات!H46<>0,سفارشات!C46,\"\")","v":""},{"$f":"IF(سفارشات!H46<>0,سفارشات!B46,\"\")","v":""},{"$f":"IF(سفارشات!H46<>0,سفارشات!D46,\"\")","v":""},{"$f":"IF(سفارشات!H46<>0,سفارشات!E46,\"\")","v":""},{"$f":"IF(سفارشات!H46<>0,سفارشات!F46,\"\")","v":""},{"$f":"IF(C48=\"\",\"\",E48-F48)","v":""}]
[{"$f":"IF(C49=\"\",\"\",ROW()-ROW($A$3))","v":""},{"$f":"IF(سفارشات!H47<>0,سفارشات!C47,\"\")","v":""},{"$f":"IF(سفارشات!H47<>0,سفارشات!B47,\"\")","v":""},{"$f":"IF(سفارشات!H47<>0,سفارشات!D47,\"\")","v":""},{"$f":"IF(سفارشات!H47<>0,سفارشات!E47,\"\")","v":""},{"$f":"IF(سفارشات!H47<>0,سفارشات!F47,\"\")","v":""},{"$f":"IF(C49=\"\",\"\",E49-F49)","v":""}]
[{"$f":"IF(C50=\"\",\"\",ROW()-ROW($A$3))","v":""},{"$f":"IF(سفارشات!H48<>0,سفارشات!C48,\"\")","v":""},{"$f":"IF(سفارشات!H48<>0,سفارشات!B48,\"\")","v":""},{"$f":"IF(سفارشات!H48<>0,سفارشات!D48,\"\")","v":""},{"$f":"IF(سفارشات!H48<>0,سفارشات!E48,\"\")","v":""},{"$f":"IF(سفارشات!H48<>0,سفارشات!F48,\"\")","v":""},{"$f":"IF(C50=\"\",\"\",E50-F50)","v":""}]
[{"$f":"IF(C51=\"\",\"\",ROW()-ROW($A$3))","v":""},{"$f":"IF(سفارشات!H49<>0,سفارشات!C49,\"\")","v":""},{"$f":"IF(سفارشات!H49<>0,سفارشات!B49,\"\")","v":""},{"$f":"IF(سفارشات!H49<>0,سفارشات!D49,\"\")","v":""},{"$f":"IF(سفارشات!H49<>0,سفارشات!E49,\"\")","v":""},{"$f":"IF(سفارشات!H49<>0,سفارشات!F49,\"\")","v":""},{"$f":"IF(C51=\"\",\"\",E51-F51)","v":""}]
[{"$f":"IF(C52=\"\",\"\",ROW()-ROW($A$3))","v":""},{"$f":"IF(سفارشات!H50<>0,سفارشات!C50,\"\")","v":""},{"$f":"IF(سفارشات!H50<>0,سفارشات!B50,\"\")","v":""},{"$f":"IF(سفارشات!H50<>0,سفارشات!D50,\"\")","v":""},{"$f":"IF(سفارشات!H50<>0,سفارشات!E50,\"\")","v":""},{"$f":"IF(سفارشات!H50<>0,سفارشات!F50,\"\")","v":""},{"$f":"IF(C52=\"\",\"\",E52-F52)","v":""}]
[{"$f":"IF(C53=\"\",\"\",ROW()-ROW($A$3))","v":""},{"$f":"IF(سفارشات!H51<>0,سفارشات!C51,\"\")","v":""},{"$f":"IF(سفارشات!H51<>0,سفارشات!B51,\"\")","v":""},{"$f":"IF(سفارشات!H51<>0,سفارشات!D51,\"\")","v":""},{"$f":"IF(سفارشات!H51<>0,سفارشات!E51,\"\")","v":""},{"$f":"IF(سفارشات!H51<>0,سفارشات!F51,\"\")","v":""},{"$f":"IF(C53=\"\",\"\",E53-F53)","v":""}]
[{"$f":"IF(C54=\"\",\"\",ROW()-ROW($A$3))","v":""},{"$f":"IF(سفارشات!H52<>0,سفارشات!C52,\"\")","v":""},{"$f":"IF(سفارشات!H52<>0,سفارشات!B52,\"\")","v":""},{"$f":"IF(سفارشات!H52<>0,سفارشات!D52,\"\")","v":""},{"$f":"IF(سفارشات!H52<>0,سفارشات!E52,\"\")","v":""},{"$f":"IF(سفارشات!H52<>0,سفارشات!F52,\"\")","v":""},{"$f":"IF(C54=\"\",\"\",E54-F54)","v":""}]
[{"$f":"IF(C55=\"\",\"\",ROW()-ROW($A$3))","v":""},{"$f":"IF(سفارشات!H53<>0,سفارشات!C53,\"\")","v":""},{"$f":"IF(سفارشات!H53<>0,سفارشات!B53,\"\")","v":""},{"$f":"IF(سفارشات!H53<>0,سفارشات!D53,\"\")","v":""},{"$f":"IF(سفارشات!H53<>0,سفارشات!E53,\"\")","v":""},{"$f":"IF(سفارشات!H53<>0,سفارشات!F53,\"\")","v":""},{"$f":"IF(C55=\"\",\"\",E55-F55)","v":""}]
[{"$f":"IF(C56=\"\",\"\",ROW()-ROW($A$3))","v":""},{"$f":"IF(سفارشات!H54<>0,سفارشات!C54,\"\")","v":""},{"$f":"IF(سفارشات!H54<>0,سفارشات!B54,\"\")","v":""},{"$f":"IF(سفارشات!H54<>0,سفارشات!D54,\"\")","v":""},{"$f":"IF(سفارشات!H54<>0,سفارشات!E54,\"\")","v":""},{"$f":"IF(سفارشات!H54<>0,سفارشات!F54,\"\")","v":""},{"$f":"IF(C56=\"\",\"\",E56-F56)","v":""}]
[{"$f":"IF(C57=\"\",\"\",ROW()-ROW($A$3))","v":""},{"$f":"IF(سفارشات!H55<>0,سفارشات!C55,\"\")","v":""},{"$f":"IF(سفارشات!H55<>0,سفارشات!B55,\"\")","v":""},{"$f":"IF(سفارشات!H55<>0,سفارشات!D55,\"\")","v":""},{"$f":"IF(سفارشات!H55<>0,سفارشات!E55,\"\")","v":""},{"$f":"IF(سفارشات!H55<>0,سفارشات!F55,\"\")","v":""},{"$f":"IF(C57=\"\",\"\",E57-F57)","v":""}]
[{"$f":"IF(C58=\"\",\"\",ROW()-ROW($A$3))","v":""},{"$f":"IF(سفارشات!H56<>0,سفارشات!C56,\"\")","v":""},{"$f":"IF(سفارشات!H56<>0,سفارشات!B56,\"\")","v":""},{"$f":"IF(سفارشات!H56<>0,سفارشات!D56,\"\")","v":""},{"$f":"IF(سفارشات!H56<>0,سفارشات!E56,\"\")","v":""},{"$f":"IF(سفارشات!H56<>0,سفارشات!F56,\"\")","v":""},{"$f":"IF(C58=\"\",\"\",E58-F58)","v":""}]
[{"$f":"IF(C59=\"\",\"\",ROW()-ROW($A$3))","v":""},{"$f":"IF(سفارشات!H57<>0,سفارشات!C57,\"\")","v":""},{"$f":"IF(سفارشات!H57<>0,سفارشات!B57,\"\")","v":""},{"$f":"IF(سفارشات!H57<>0,سفارشات!D57,\"\")","v":""},{"$f":"IF(سفارشات!H57<>0,سفارشات!E57,\"\")","v":""},{"$f":"IF(سفارشات!H57<>0,سفارشات!F57,\"\")","v":""},{"$f":"IF(C59=\"\",\"\",E59-F59)","v":""}]
[{"$f":"IF(C60=\"\",\"\",ROW()-ROW($A$3))","v":""},{"$f":"IF(سفارشات!H58<>0,سفارشات!C58,\"\")","v":""},{"$f":"IF(سفارشات!H58<>0,سفارشات!B58,\"\")","v":""},{"$f":"IF(سفارشات!H58<>0,سفارشات!D58,\"\")","v":""},{"$f":"IF(سفارشات!H58<>0,سفارشات!E58,\"\")","v":""},{"$f":"IF(سفارشات!H58<>0,سفارشات!F58,\"\")","v":""},{"$f":"IF(C60=\"\",\"\",E60-F60)","v":""}]
[{"$f":"IF(C61=\"\",\"\",ROW()-ROW($A$3))","v":""},{"$f":"IF(سفارشات!H59<>0,سفارشات!C59,\"\")","v":""},{"$f":"IF(سفارشات!H59<>0,سفارشات!B59,\"\")","v":""},{"$f":"IF(سفارشات!H59<>0,سفارشات!D59,\"\")","v":""},{"$f":"IF(سفارشات!H59<>0,سفارشات!E59,\"\")","v":""},{"$f":"IF(سفارشات!H59<>0,سفارشات!F59,\"\")","v":""},{"$f":"IF(C61=\"\",\"\",E61-F61)","v":""}]
[{"$f":"IF(C62=\"\",\"\",ROW()-ROW($A$3))","v":""},{"$f":"IF(سفارشات!H60<>0,سفارشات!C60,\"\")","v":""},{"$f":"IF(سفارشات!H60<>0,سفارشات!B60,\"\")","v":""},{"$f":"IF(سفارشات!H60<>0,سفارشات!D60,\"\")","v":""},{"$f":"IF(سفارشات!H60<>0,سفارشات!E60,\"\")","v":""},{"$f":"IF(سفارشات!H60<>0,سفارشات!F60,\"\")","v":""},{"$f":"IF(C62=\"\",\"\",E62-F62)","v":""}]
[{"$f":"IF(C63=\"\",\"\",ROW()-ROW($A$3))","v":""},{"$f":"IF(سفارشات!H61<>0,سفارشات!C61,\"\")","v":""},{"$f":"IF(سفارشات!H61<>0,سفارشات!B61,\"\")","v":""},{"$f":"IF(سفارشات!H61<>0,سفارشات!D61,\"\")","v":""},{"$f":"IF(سفارشات!H61<>0,سفارشات!E61,\"\")","v":""},{"$f":"IF(سفارشات!H61<>0,سفارشات!F61,\"\")","v":""},{"$f":"IF(C63=\"\",\"\",E63-F63)","v":""}]
[{"$f":"IF(C64=\"\",\"\",ROW()-ROW($A$3))","v":""},{"$f":"IF(سفارشات!H62<>0,سفارشات!C62,\"\")","v":""},{"$f":"IF(سفارشات!H62<>0,سفارشات!B62,\"\")","v":""},{"$f":"IF(سفارشات!H62<>0,سفارشات!D62,\"\")","v":""},{"$f":"IF(سفارشات!H62<>0,سفارشات!E62,\"\")","v":""},{"$f":"IF(سفارشات!H62<>0,سفارشات!F62,\"\")","v":""},{"$f":"IF(C64=\"\",\"\",E64-F64)","v":""}]
[{"$f":"IF(C65=\"\",\"\",ROW()-ROW($A$3))","v":""},{"$f":"IF(سفارشات!H63<>0,سفارشات!C63,\"\")","v":""},{"$f":"IF(سفارشات!H63<>0,سفارشات!B63,\"\")","v":""},{"$f":"IF(سفارشات!H63<>0,سفارشات!D63,\"\")","v":""},{"$f":"IF(سفارشات!H63<>0,سفارشات!E63,\"\")","v":""},{"$f":"IF(سفارشات!H63<>0,سفارشات!F63,\"\")","v":""},{"$f":"IF(C65=\"\",\"\",E65-F65)","v":""}]
[{"$f":"IF(C66=\"\",\"\",ROW()-ROW($A$3))","v":""},{"$f":"IF(سفارشات!H64<>0,سفارشات!C64,\"\")","v":""},{"$f":"IF(سفارشات!H64<>0,سفارشات!B64,\"\")","v":""},{"$f":"IF(سفارشات!H64<>0,سفارشات!D64,\"\")","v":""},{"$f":"IF(سفارشات!H64<>0,سفارشات!E64,\"\")","v":""},{"$f":"IF(سفارشات!H64<>0,سفارشات!F64,\"\")","v":""},{"$f":"IF(C66=\"\",\"\",E66-F66)","v":""}]
[{"$f":"IF(C67=\"\",\"\",ROW()-ROW($A$3))","v":""},{"$f":"IF(سفارشات!H65<>0,سفارشات!C65,\"\")","v":""},{"$f":"IF(سفارشات!H65<>0,سفارشات!B65,\"\")","v":""},{"$f":"IF(سفارشات!H65<>0,سفارشات!D65,\"\")","v":""},{"$f":"IF(سفارشات!H65<>0,سفارشات!E65,\"\")","v":""},{"$f":"IF(سفارشات!H65<>0,سفارشات!F65,\"\")","v":""},{"$f":"IF(C67=\"\",\"\",E67-F67)","v":""}]
[{"$f":"IF(C68=\"\",\"\",ROW()-ROW($A$3))","v":""},{"$f":"IF(سفارشات!H66<>0,سفارشات!C66,\"\")","v":""},{"$f":"IF(سفارشات!H66<>0,سفارشات!B66,\"\")","v":""},{"$f":"IF(سفارشات!H66<>0,سفارشات!D66,\"\")","v":""},{"$f":"IF(سفارشات!H66<>0,سفارشات!E66,\"\")","v":""},{"$f":"IF(سفارشات!H66<>0,سفارشات!F66,\"\")","v":""},{"$f":"IF(C68=\"\",\"\",E68-F68)","v":""}]
[{"$f":"IF(C69=\"\",\"\",ROW()-ROW($A$3))","v":""},{"$f":"IF(سفارشات!H67<>0,سفارشات!C67,\"\")","v":""},{"$f":"IF(سفارشات!H67<>0,سفارشات!B67,\"\")","v":""},{"$f":"IF(سفارشات!H67<>0,سفارشات!D67,\"\")","v":""},{"$f":"IF(سفارشات!H67<>0,سفارشات!E67,\"\")","v":""},{"$f":"IF(سفارشات!H67<>0,سفارشات!F67,\"\")","v":""},{"$f":"IF(C69=\"\",\"\",E69-F69)","v":""}]
[{"$f":"IF(C70=\"\",\"\",ROW()-ROW($A$3))","v":""},{"$f":"IF(سفارشات!H68<>0,سفارشات!C68,\"\")","v":""},{"$f":"IF(سفارشات!H68<>0,سفارشات!B68,\"\")","v":""},{"$f":"IF(سفارشات!H68<>0,سفارشات!D68,\"\")","v":""},{"$f":"IF(سفارشات!H68<>0,سفارشات!E68,\"\")","v":""},{"$f":"IF(سفارشات!H68<>0,سفارشات!F68,\"\")","v":""},{"$f":"IF(C70=\"\",\"\",E70-F70)","v":""}]
[{"$f":"IF(C71=\"\",\"\",ROW()-ROW($A$3))","v":""},{"$f":"IF(سفارشات!H69<>0,سفارشات!C69,\"\")","v":""},{"$f":"IF(سفارشات!H69<>0,سفارشات!B69,\"\")","v":""},{"$f":"IF(سفارشات!H69<>0,سفارشات!D69,\"\")","v":""},{"$f":"IF(سفارشات!H69<>0,سفارشات!E69,\"\")","v":""},{"$f":"IF(سفارشات!H69<>0,سفارشات!F69,\"\")","v":""},{"$f":"IF(C71=\"\",\"\",E71-F71)","v":""}]
[{"$f":"IF(C72=\"\",\"\",ROW()-ROW($A$3))","v":""},{"$f":"IF(سفارشات!H70<>0,سفارشات!C70,\"\")","v":""},{"$f":"IF(سفارشات!H70<>0,سفارشات!B70,\"\")","v":""},{"$f":"IF(سفارشات!H70<>0,سفارشات!D70,\"\")","v":""},{"$f":"IF(سفارشات!H70<>0,سفارشات!E70,\"\")","v":""},{"$f":"IF(سفارشات!H70<>0,سفارشات!F70,\"\")","v":""},{"$f":"IF(C72=\"\",\"\",E72-F72)","v":""}]
[{"$f":"IF(C73=\"\",\"\",ROW()-ROW($A$3))","v":""},{"$f":"IF(سفارشات!H71<>0,سفارشات!C71,\"\")","v":""},{"$f":"IF(سفارشات!H71<>0,سفارشات!B71,\"\")","v":""},{"$f":"IF(سفارشات!H71<>0,سفارشات!D71,\"\")","v":""},{"$f":"IF(سفارشات!H71<>0,سفارشات!E71,\"\")","v":""},{"$f":"IF(سفارشات!H71<>0,سفارشات!F71,\"\")","v":""},{"$f":"IF(C73=\"\",\"\",E73-F73)","v":""}]
[{"$f":"IF(C74=\"\",\"\",ROW()-ROW($A$3))","v":""},{"$f":"IF(سفارشات!H72<>0,سفارشات!C72,\"\")","v":""},{"$f":"IF(سفارشات!H72<>0,سفارشات!B72,\"\")","v":""},{"$f":"IF(سفارشات!H72<>0,سفارشات!D72,\"\")","v":""},{"$f":"IF(سفارشات!H72<>0,سفارشات!E72,\"\")","v":""},{"$f":"IF(سفارشات!H72<>0,سفارشات!F72,\"\")","v":""},{"$f":"IF(C74=\"\",\"\",E74-F74)","v":""}]
[{"$f":"IF(C75=\"\",\"\",ROW()-ROW($A$3))","v":""},{"$f":"IF(سفارشات!H73<>0,سفارشات!C73,\"\")","v":""},{"$f":"IF(سفارشات!H73<>0,سفارشات!B73,\"\")","v":""},{"$f":"IF(سفارشات!H73<>0,سفارشات!D73,\"\")","v":""},{"$f":"IF(سفارشات!H73<>0,سفارشات!E73,\"\")","v":""},{"$f":"IF(سفارشات!H73<>0,سفارشات!F73,\"\")","v":""},{"$f":"IF(C75=\"\",\"\",E75-F75)","v":""}]
[{"$f":"IF(C76=\"\",\"\",ROW()-ROW($A$3))","v":""},{"$f":"IF(سفارشات!H74<>0,سفارشات!C74,\"\")","v":""},{"$f":"IF(سفارشات!H74<>0,سفارشات!B74,\"\")","v":""},{"$f":"IF(سفارشات!H74<>0,سفارشات!D74,\"\")","v":""},{"$f":"IF(سفارشات!H74<>0,سفارشات!E74,\"\")","v":""},{"$f":"IF(سفارشات!H74<>0,سفارشات!F74,\"\")","v":""},{"$f":"IF(C76=\"\",\"\",E76-F76)","v":""}]
[{"$f":"IF(C77=\"\",\"\",ROW()-ROW($A$3))","v":""},{"$f":"IF(سفارشات!H75<>0,سفارشات!C75,\"\")","v":""},{"$f":"IF(سفارشات!H75<>0,سفارشات!B75,\"\")","v":""},{"$f":"IF(سفارشات!H75<>0,سفارشات!D75,\"\")","v":""},{"$f":"IF(سفارشات!H75<>0,سفارشات!E75,\"\")","v":""},{"$f":"IF(سفارشات!H75<>0,سفارشات!F75,\"\")","v":""},{"$f":"IF(C77=\"\",\"\",E77-F77)","v":""}]
[{"$f":"IF(C78=\"\",\"\",ROW()-ROW($A$3))","v":""},{"$f":"IF(سفارشات!H76<>0,سفارشات!C76,\"\")","v":""},{"$f":"IF(سفارشات!H76<>0,سفارشات!B76,\"\")","v":""},{"$f":"IF(سفارشات!H76<>0,سفارشات!D76,\"\")","v":""},{"$f":"IF(سفارشات!H76<>0,سفارشات!E76,\"\")","v":""},{"$f":"IF(سفارشات!H76<>0,سفارشات!F76,\"\")","v":""},{"$f":"IF(C78=\"\",\"\",E78-F78)","v":""}]
[{"$f":"IF(C79=\"\",\"\",ROW()-ROW($A$3))","v":""},{"$f":"IF(سفارشات!H77<>0,سفارشات!C77,\"\")","v":""},{"$f":"IF(سفارشات!H77<>0,سفارشات!B77,\"\")","v":""},{"$f":"IF(سفارشات!H77<>0,سفارشات!D77,\"\")","v":""},{"$f":"IF(سفارشات!H77<>0,سفارشات!E77,\"\")","v":""},{"$f":"IF(سفارشات!H77<>0,سفارشات!F77,\"\")","v":""},{"$f":"IF(C79=\"\",\"\",E79-F79)","v":""}]
[{"$f":"IF(C80=\"\",\"\",ROW()-ROW($A$3))","v":""},{"$f":"IF(سفارشات!H78<>0,سفارشات!C78,\"\")","v":""},{"$f":"IF(سفارشات!H78<>0,سفارشات!B78,\"\")","v":""},{"$f":"IF(سفارشات!H78<>0,سفارشات!D78,\"\")","v":""},{"$f":"IF(سفارشات!H78<>0,سفارشات!E78,\"\")","v":""},{"$f":"IF(سفارشات!H78<>0,سفارشات!F78,\"\")","v":""},{"$f":"IF(C80=\"\",\"\",E80-F80)","v":""}]
[{"$f":"IF(C81=\"\",\"\",ROW()-ROW($A$3))","v":""},{"$f":"IF(سفارشات!H79<>0,سفارشات!C79,\"\")","v":""},{"$f":"IF(سفارشات!H79<>0,سفارشات!B79,\"\")","v":""},{"$f":"IF(سفارشات!H79<>0,سفارشات!D79,\"\")","v":""},{"$f":"IF(سفارشات!H79<>0,سفارشات!E79,\"\")","v":""},{"$f":"IF(سفارشات!H79<>0,سفارشات!F79,\"\")","v":""},{"$f":"IF(C81=\"\",\"\",E81-F81)","v":""}]
[{"$f":"IF(C82=\"\",\"\",ROW()-ROW($A$3))","v":""},{"$f":"IF(سفارشات!H80<>0,سفارشات!C80,\"\")","v":""},{"$f":"IF(سفارشات!H80<>0,سفارشات!B80,\"\")","v":""},{"$f":"IF(سفارشات!H80<>0,سفارشات!D80,\"\")","v":""},{"$f":"IF(سفارشات!H80<>0,سفارشات!E80,\"\")","v":""},{"$f":"IF(سفارشات!H80<>0,سفارشات!F80,\"\")","v":""},{"$f":"IF(C82=\"\",\"\",E82-F82)","v":""}]
[{"$f":"IF(C83=\"\",\"\",ROW()-ROW($A$3))","v":""},{"$f":"IF(سفارشات!H81<>0,سفارشات!C81,\"\")","v":""},{"$f":"IF(سفارشات!H81<>0,سفارشات!B81,\"\")","v":""},{"$f":"IF(سفارشات!H81<>0,سفارشات!D81,\"\")","v":""},{"$f":"IF(سفارشات!H81<>0,سفارشات!E81,\"\")","v":""},{"$f":"IF(سفارشات!H81<>0,سفارشات!F81,\"\")","v":""},{"$f":"IF(C83=\"\",\"\",E83-F83)","v":""}]
[{"$f":"IF(C84=\"\",\"\",ROW()-ROW($A$3))","v":""},{"$f":"IF(سفارشات!H82<>0,سفارشات!C82,\"\")","v":""},{"$f":"IF(سفارشات!H82<>0,سفارشات!B82,\"\")","v":""},{"$f":"IF(سفارشات!H82<>0,سفارشات!D82,\"\")","v":""},{"$f":"IF(سفارشات!H82<>0,سفارشات!E82,\"\")","v":""},{"$f":"IF(سفارشات!H82<>0,سفارشات!F82,\"\")","v":""},{"$f":"IF(C84=\"\",\"\",E84-F84)","v":""}]
[{"$f":"IF(C85=\"\",\"\",ROW()-ROW($A$3))","v":""},{"$f":"IF(سفارشات!H83<>0,سفارشات!C83,\"\")","v":""},{"$f":"IF(سفارشات!H83<>0,سفارشات!B83,\"\")","v":""},{"$f":"IF(سفارشات!H83<>0,سفارشات!D83,\"\")","v":""},{"$f":"IF(سفارشات!H83<>0,سفارشات!E83,\"\")","v":""},{"$f":"IF(سفارشات!H83<>0,سفارشات!F83,\"\")","v":""},{"$f":"IF(C85=\"\",\"\",E85-F85)","v":""}]
[{"$f":"IF(C86=\"\",\"\",ROW()-ROW($A$3))","v":""},{"$f":"IF(سفارشات!H84<>0,سفارشات!C84,\"\")","v":""},{"$f":"IF(سفارشات!H84<>0,سفارشات!B84,\"\")","v":""},{"$f":"IF(سفارشات!H84<>0,سفارشات!D84,\"\")","v":""},{"$f":"IF(سفارشات!H84<>0,سفارشات!E84,\"\")","v":""},{"$f":"IF(سفارشات!H84<>0,سفارشات!F84,\"\")","v":""},{"$f":"IF(C86=\"\",\"\",E86-F86)","v":""}]
[{"$f":"IF(C87=\"\",\"\",ROW()-ROW($A$3))","v":""},{"$f":"IF(سفارشات!H85<>0,سفارشات!C85,\"\")","v":""},{"$f":"IF(سفارشات!H85<>0,سفارشات!B85,\"\")","v":""},{"$f":"IF(سفارشات!H85<>0,سفارشات!D85,\"\")","v":""},{"$f":"IF(سفارشات!H85<>0,سفارشات!E85,\"\")","v":""},{"$f":"IF(سفارشات!H85<>0,سفارشات!F85,\"\")","v":""},{"$f":"IF(C87=\"\",\"\",E87-F87)","v":""}]
[{"$f":"IF(C88=\"\",\"\",ROW()-ROW($A$3))","v":""},{"$f":"IF(سفارشات!H86<>0,سفارشات!C86,\"\")","v":""},{"$f":"IF(سفارشات!H86<>0,سفارشات!B86,\"\")","v":""},{"$f":"IF(سفارشات!H86<>0,سفارشات!D86,\"\")","v":""},{"$f":"IF(سفارشات!H86<>0,سفارشات!E86,\"\")","v":""},{"$f":"IF(سفارشات!H86<>0,سفارشات!F86,\"\")","v":""},{"$f":"IF(C88=\"\",\"\",E88-F88)","v":""}]
[{"$f":"IF(C89=\"\",\"\",ROW()-ROW($A$3))","v":""},{"$f":"IF(سفارشات!H87<>0,سفارشات!C87,\"\")","v":""},{"$f":"IF(سفارشات!H87<>0,سفارشات!B87,\"\")","v":""},{"$f":"IF(سفارشات!H87<>0,سفارشات!D87,\"\")","v":""},{"$f":"IF(سفارشات!H87<>0,سفارشات!E87,\"\")","v":""},{"$f":"IF(سفارشات!H87<>0,سفارشات!F87,\"\")","v":""},{"$f":"IF(C89=\"\",\"\",E89-F89)","v":""}]
[{"$f":"IF(C90=\"\",\"\",ROW()-ROW($A$3))","v":""},{"$f":"IF(سفارشات!H88<>0,سفارشات!C88,\"\")","v":""},{"$f":"IF(سفارشات!H88<>0,سفارشات!B88,\"\")","v":""},{"$f":"IF(سفارشات!H88<>0,سفارشات!D88,\"\")","v":""},{"$f":"IF(سفارشات!H88<>0,سفارشات!E88,\"\")","v":""},{"$f":"IF(سفارشات!H88<>0,سفارشات!F88,\"\")","v":""},{"$f":"IF(C90=\"\",\"\",E90-F90)","v":""}]
[{"$f":"IF(C91=\"\",\"\",ROW()-ROW($A$3))","v":""},{"$f":"IF(سفارشات!H89<>0,سفارشات!C89,\"\")","v":""},{"$f":"IF(سفارشات!H89<>0,سفارشات!B89,\"\")","v":""},{"$f":"IF(سفارشات!H89<>0,سفارشات!D89,\"\")","v":""},{"$f":"IF(سفارشات!H89<>0,سفارشات!E89,\"\")","v":""},{"$f":"IF(سفارشات!H89<>0,سفارشات!F89,\"\")","v":""},{"$f":"IF(C91=\"\",\"\",E91-F91)","v":""}]
[{"$f":"IF(C92=\"\",\"\",ROW()-ROW($A$3))","v":""},{"$f":"IF(سفارشات!H90<>0,سفارشات!C90,\"\")","v":""},{"$f":"IF(سفارشات!H90<>0,سفارشات!B90,\"\")","v":""},{"$f":"IF(سفارشات!H90<>0,سفارشات!D90,\"\")","v":""},{"$f":"IF(سفارشات!H90<>0,سفارشات!E90,\"\")","v":""},{"$f":"IF(سفارشات!H90<>0,سفارشات!F90,\"\")","v":""},{"$f":"IF(C92=\"\",\"\",E92-F92)","v":""}]
[{"$f":"IF(C93=\"\",\"\",ROW()-ROW($A$3))","v":""},{"$f":"IF(سفارشات!H91<>0,سفارشات!C91,\"\")","v":""},{"$f":"IF(سفارشات!H91<>0,سفارشات!B91,\"\")","v":""},{"$f":"IF(سفارشات!H91<>0,سفارشات!D91,\"\")","v":""},{"$f":"IF(سفارشات!H91<>0,سفارشات!E91,\"\")","v":""},{"$f":"IF(سفارشات!H91<>0,سفارشات!F91,\"\")","v":""},{"$f":"IF(C93=\"\",\"\",E93-F93)","v":""}]
[{"$f":"IF(C94=\"\",\"\",ROW()-ROW($A$3))","v":""},{"$f":"IF(سفارشات!H92<>0,سفارشات!C92,\"\")","v":""},{"$f":"IF(سفارشات!H92<>0,سفارشات!B92,\"\")","v":""},{"$f":"IF(سفارشات!H92<>0,سفارشات!D92,\"\")","v":""},{"$f":"IF(سفارشات!H92<>0,سفارشات!E92,\"\")","v":""},{"$f":"IF(سفارشات!H92<>0,سفارشات!F92,\"\")","v":""},{"$f":"IF(C94=\"\",\"\",E94-F94)","v":""}]
[{"$f":"IF(C95=\"\",\"\",ROW()-ROW($A$3))","v":""},{"$f":"IF(سفارشات!H93<>0,سفارشات!C93,\"\")","v":""},{"$f":"IF(سفارشات!H93<>0,سفارشات!B93,\"\")","v":""},{"$f":"IF(سفارشات!H93<>0,سفارشات!D93,\"\")","v":""},{"$f":"IF(سفارشات!H93<>0,سفارشات!E93,\"\")","v":""},{"$f":"IF(سفارشات!H93<>0,سفارشات!F93,\"\")","v":""},{"$f":"IF(C95=\"\",\"\",E95-F95)","v":""}]
[{"$f":"IF(C96=\"\",\"\",ROW()-ROW($A$3))","v":""},{"$f":"IF(سفارشات!H94<>0,سفارشات!C94,\"\")","v":""},{"$f":"IF(سفارشات!H94<>0,سفارشات!B94,\"\")","v":""},{"$f":"IF(سفارشات!H94<>0,سفارشات!D94,\"\")","v":""},{"$f":"IF(سفارشات!H94<>0,سفارشات!E94,\"\")","v":""},{"$f":"IF(سفارشات!H94<>0,سفارشات!F94,\"\")","v":""},{"$f":"IF(C96=\"\",\"\",E96-F96)","v":""}]
[{"$f":"IF(C97=\"\",\"\",ROW()-ROW($A$3))","v":""},{"$f":"IF(سفارشات!H95<>0,سفارشات!C95,\"\")","v":""},{"$f":"IF(سفارشات!H95<>0,سفارشات!B95,\"\")","v":""},{"$f":"IF(سفارشات!H95<>0,سفارشات!D95,\"\")","v":""},{"$f":"IF(سفارشات!H95<>0,سفارشات!E95,\"\")","v":""},{"$f":"IF(سفارشات!H95<>0,سفارشات!F95,\"\")","v":""},{"$f":"IF(C97=\"\",\"\",E97-F97)","v":""}]
[{"$f":"IF(C98=\"\",\"\",ROW()-ROW($A$3))","v":""},{"$f":"IF(سفارشات!H96<>0,سفارشات!C96,\"\")","v":""},{"$f":"IF(سفارشات!H96<>0,سفارشات!B96,\"\")","v":""},{"$f":"IF(سفارشات!H96<>0,سفارشات!D96,\"\")","v":""},{"$f":"IF(سفارشات!H96<>0,سفارشات!E96,\"\")","v":""},{"$f":"IF(سفارشات!H96<>0,سفارشات!F96,\"\")","v":""},{"$f":"IF(C98=\"\",\"\",E98-F98)","v":""}]
[{"$f":"IF(C99=\"\",\"\",ROW()-ROW($A$3))","v":""},{"$f":"IF(سفارشات!H97<>0,سفارشات!C97,\"\")","v":""},{"$f":"IF(سفارشات!H97<>0,سفارشات!B97,\"\")","v":""},{"$f":"IF(سفارشات!H97<>0,سفارشات!D97,\"\")","v":""},{"$f":"IF(سفارشات!H97<>0,سفارشات!E97,\"\")","v":""},{"$f":"IF(سفارشات!H97<>0,سفارشات!F97,\"\")","v":""},{"$f":"IF(C99=\"\",\"\",E99-F99)","v":""}]
[{"$f":"IF(C100=\"\",\"\",ROW()-ROW($A$3))","v":""},{"$f":"IF(سفارشات!H98<>0,سفارشات!C98,\"\")","v":""},{"$f":"IF(سفارشات!H98<>0,سفارشات!B98,\"\")","v":""},{"$f":"IF(سفارشات!H98<>0,سفارشات!D98,\"\")","v":""},{"$f":"IF(سفارشات!H98<>0,سفارشات!E98,\"\")","v":""},{"$f":"IF(سفارشات!H98<>0,سفارشات!F98,\"\")","v":""},{"$f":"IF(C100=\"\",\"\",E100-F100)","v":""}]
[{"$f":"IF(C101=\"\",\"\",ROW()-ROW($A$3))","v":""},{"$f":"IF(سفارشات!H99<>0,سفارشات!C99,\"\")","v":""},{"$f":"IF(سفارشات!H99<>0,سفارشات!B99,\"\")","v":""},{"$f":"IF(سفارشات!H99<>0,سفارشات!D99,\"\")","v":""},{"$f":"IF(سفارشات!H99<>0,سفارشات!E99,\"\")","v":""},{"$f":"IF(سفارشات!H99<>0,سفارشات!F99,\"\")","v":""},{"$f":"IF(C101=\"\",\"\",E101-F101)","v":""}]
[{"$f":"IF(C102=\"\",\"\",ROW()-ROW($A$3))","v":""},{"$f":"IF(سفارشات!H100<>0,سفارشات!C100,\"\")","v":""},{"$f":"IF(سفارشات!H100<>0,سفارشات!B100,\"\")","v":""},{"$f":"IF(سفارشات!H100<>0,سفارشات!D100,\"\")","v":""},{"$f":"IF(سفارشات!H100<>0,سفارشات!E100,\"\")","v":""},{"$f":"IF(سفارشات!H100<>0,سفارشات!F100,\"\")","v":""},{"$f":"IF(C102=\"\",\"\",E102-F102)","v":""}]
[{"$f":"IF(C103=\"\",\"\",ROW()-ROW($A$3))","v":""},{"$f":"IF(سفارشات!H101<>0,سفارشات!C101,\"\")","v":""},{"$f":"IF(سفارشات!H101<>0,سفارشات!B101,\"\")","v":""},{"$f":"IF(سفارشات!H101<>0,سفارشات!D101,\"\")","v":""},{"$f":"IF(سفارشات!H101<>0,سفارشات!E101,\"\")","v":""},{"$f":"IF(سفارشات!H101<>0,سفارشات!F101,\"\")","v":""},{"$f":"IF(C103=\"\",\"\",E103-F103)","v":""}]
[{"$f":"IF(C104=\"\",\"\",ROW()-ROW($A$3))","v":""},{"$f":"IF(سفارشات!H102<>0,سفارشات!C102,\"\")","v":""},{"$f":"IF(سفارشات!H102<>0,سفارشات!B102,\"\")","v":""},{"$f":"IF(سفارشات!H102<>0,سفارشات!D102,\"\")","v":""},{"$f":"IF(سفارشات!H102<>0,سفارشات!E102,\"\")","v":""},{"$f":"IF(سفارشات!H102<>0,سفارشات!F102,\"\")","v":""},{"$f":"IF(C104=\"\",\"\",E104-F104)","v":""}]
[{"$f":"IF(C105=\"\",\"\",ROW()-ROW($A$3))","v":""},{"$f":"IF(سفارشات!H103<>0,سفارشات!C103,\"\")","v":""},{"$f":"IF(سفارشات!H103<>0,سفارشات!B103,\"\")","v":""},{"$f":"IF(سفارشات!H103<>0,سفارشات!D103,\"\")","v":""},{"$f":"IF(سفارشات!H103<>0,سفارشات!E103,\"\")","v":""},{"$f":"IF(سفارشات!H103<>0,سفارشات!F103,\"\")","v":""},{"$f":"IF(C105=\"\",\"\",E105-F105)","v":""}]
[{"$f":"IF(C106=\"\",\"\",ROW()-ROW($A$3))","v":""},{"$f":"IF(سفارشات!H104<>0,سفارشات!C104,\"\")","v":""},{"$f":"IF(سفارشات!H104<>0,سفارشات!B104,\"\")","v":""},{"$f":"IF(سفارشات!H104<>0,سفارشات!D104,\"\")","v":""},{"$f":"IF(سفارشات!H104<>0,سفارشات!E104,\"\")","v":""},{"$f":"IF(سفارشات!H104<>0,سفارشات!F104,\"\")","v":""},{"$f":"IF(C106=\"\",\"\",E106-F106)","v":""}]
[{"$f":"IF(C107=\"\",\"\",ROW()-ROW($A$3))","v":""},{"$f":"IF(سفارشات!H105<>0,سفارشات!C105,\"\")","v":""},{"$f":"IF(سفارشات!H105<>0,سفارشات!B105,\"\")","v":""},{"$f":"IF(سفارشات!H105<>0,سفارشات!D105,\"\")","v":""},{"$f":"IF(سفارشات!H105<>0,سفارشات!E105,\"\")","v":""},{"$f":"IF(سفارشات!H105<>0,سفارشات!F105,\"\")","v":""},{"$f":"IF(C107=\"\",\"\",E107-F107)","v":""}]
[{"$f":"IF(C108=\"\",\"\",ROW()-ROW($A$3))","v":""},{"$f":"IF(سفارشات!H106<>0,سفارشات!C106,\"\")","v":""},{"$f":"IF(سفارشات!H106<>0,سفارشات!B106,\"\")","v":""},{"$f":"IF(سفارشات!H106<>0,سفارشات!D106,\"\")","v":""},{"$f":"IF(سفارشات!H106<>0,سفارشات!E106,\"\")","v":""},{"$f":"IF(سفارشات!H106<>0,سفارشات!F106,\"\")","v":""},{"$f":"IF(C108=\"\",\"\",E108-F108)","v":""}]
[{"$f":"IF(C109=\"\",\"\",ROW()-ROW($A$3))","v":""},{"$f":"IF(سفارشات!H107<>0,سفارشات!C107,\"\")","v":""},{"$f":"IF(سفارشات!H107<>0,سفارشات!B107,\"\")","v":""},{"$f":"IF(سفارشات!H107<>0,سفارشات!D107,\"\")","v":""},{"$f":"IF(سفارشات!H107<>0,سفارشات!E107,\"\")","v":""},{"$f":"IF(سفارشات!H107<>0,سفارشات!F107,\"\")","v":""},{"$f":"IF(C109=\"\",\"\",E109-F109)","v":""}]
[{"$f":"IF(C110=\"\",\"\",ROW()-ROW($A$3))","v":""},{"$f":"IF(سفارشات!H108<>0,سفارشات!C108,\"\")","v":""},{"$f":"IF(سفارشات!H108<>0,سفارشات!B108,\"\")","v":""},{"$f":"IF(سفارشات!H108<>0,سفارشات!D108,\"\")","v":""},{"$f":"IF(سفارشات!H108<>0,سفارشات!E108,\"\")","v":""},{"$f":"IF(سفارشات!H108<>0,سفارشات!F108,\"\")","v":""},{"$f":"IF(C110=\"\",\"\",E110-F110)","v":""}]
[{"$f":"IF(C111=\"\",\"\",ROW()-ROW($A$3))","v":""},{"$f":"IF(سفارشات!H109<>0,سفارشات!C109,\"\")","v":""},{"$f":"IF(سفارشات!H109<>0,سفارشات!B109,\"\")","v":""},{"$f":"IF(سفارشات!H109<>0,سفارشات!D109,\"\")","v":""},{"$f":"IF(سفارشات!H109<>0,سفارشات!E109,\"\")","v":""},{"$f":"IF(سفارشات!H109<>0,سفارشات!F109,\"\")","v":""},{"$f":"IF(C111=\"\",\"\",E111-F111)","v":""}]
[{"$f":"IF(C112=\"\",\"\",ROW()-ROW($A$3))","v":""},{"$f":"IF(سفارشات!H110<>0,سفارشات!C110,\"\")","v":""},{"$f":"IF(سفارشات!H110<>0,سفارشات!B110,\"\")","v":""},{"$f":"IF(سفارشات!H110<>0,سفارشات!D110,\"\")","v":""},{"$f":"IF(سفارشات!H110<>0,سفارشات!E110,\"\")","v":""},{"$f":"IF(سفارشات!H110<>0,سفارشات!F110,\"\")","v":""},{"$f":"IF(C112=\"\",\"\",E112-F112)","v":""}]
[{"$f":"IF(C113=\"\",\"\",ROW()-ROW($A$3))","v":""},{"$f":"IF(سفارشات!H111<>0,سفارشات!C111,\"\")","v":""},{"$f":"IF(سفارشات!H111<>0,سفارشات!B111,\"\")","v":""},{"$f":"IF(سفارشات!H111<>0,سفارشات!D111,\"\")","v":""},{"$f":"IF(سفارشات!H111<>0,سفارشات!E111,\"\")","v":""},{"$f":"IF(سفارشات!H111<>0,سفارشات!F111,\"\")","v":""},{"$f":"IF(C113=\"\",\"\",E113-F113)","v":""}]
[{"$f":"IF(C114=\"\",\"\",ROW()-ROW($A$3))","v":""},{"$f":"IF(سفارشات!H112<>0,سفارشات!C112,\"\")","v":""},{"$f":"IF(سفارشات!H112<>0,سفارشات!B112,\"\")","v":""},{"$f":"IF(سفارشات!H112<>0,سفارشات!D112,\"\")","v":""},{"$f":"IF(سفارشات!H112<>0,سفارشات!E112,\"\")","v":""},{"$f":"IF(سفارشات!H112<>0,سفارشات!F112,\"\")","v":""},{"$f":"IF(C114=\"\",\"\",E114-F114)","v":""}]
[{"$f":"IF(C115=\"\",\"\",ROW()-ROW($A$3))","v":""},{"$f":"IF(سفارشات!H113<>0,سفارشات!C113,\"\")","v":""},{"$f":"IF(سفارشات!H113<>0,سفارشات!B113,\"\")","v":""},{"$f":"IF(سفارشات!H113<>0,سفارشات!D113,\"\")","v":""},{"$f":"IF(سفارشات!H113<>0,سفارشات!E113,\"\")","v":""},{"$f":"IF(سفارشات!H113<>0,سفارشات!F113,\"\")","v":""},{"$f":"IF(C115=\"\",\"\",E115-F115)","v":""}]
[{"$f":"IF(C116=\"\",\"\",ROW()-ROW($A$3))","v":""},{"$f":"IF(سفارشات!H114<>0,سفارشات!C114,\"\")","v":""},{"$f":"IF(سفارشات!H114<>0,سفارشات!B114,\"\")","v":""},{"$f":"IF(سفارشات!H114<>0,سفارشات!D114,\"\")","v":""},{"$f":"IF(سفارشات!H114<>0,سفارشات!E114,\"\")","v":""},{"$f":"IF(سفارشات!H114<>0,سفارشات!F114,\"\")","v":""},{"$f":"IF(C116=\"\",\"\",E116-F116)","v":""}]
[{"$f":"IF(C117=\"\",\"\",ROW()-ROW($A$3))","v":""},{"$f":"IF(سفارشات!H115<>0,سفارشات!C115,\"\")","v":""},{"$f":"IF(سفارشات!H115<>0,سفارشات!B115,\"\")","v":""},{"$f":"IF(سفارشات!H115<>0,سفارشات!D115,\"\")","v":""},{"$f":"IF(سفارشات!H115<>0,سفارشات!E115,\"\")","v":""},{"$f":"IF(سفارشات!H115<>0,سفارشات!F115,\"\")","v":""},{"$f":"IF(C117=\"\",\"\",E117-F117)","v":""}]
[{"$f":"IF(C118=\"\",\"\",ROW()-ROW($A$3))","v":""},{"$f":"IF(سفارشات!H116<>0,سفارشات!C116,\"\")","v":""},{"$f":"IF(سفارشات!H116<>0,سفارشات!B116,\"\")","v":""},{"$f":"IF(سفارشات!H116<>0,سفارشات!D116,\"\")","v":""},{"$f":"IF(سفارشات!H116<>0,سفارشات!E116,\"\")","v":""},{"$f":"IF(سفارشات!H116<>0,سفارشات!F116,\"\")","v":""},{"$f":"IF(C118=\"\",\"\",E118-F118)","v":""}]
[{"$f":"IF(C119=\"\",\"\",ROW()-ROW($A$3))","v":""},{"$f":"IF(سفارشات!H117<>0,سفارشات!C117,\"\")","v":""},{"$f":"IF(سفارشات!H117<>0,سفارشات!B117,\"\")","v":""},{"$f":"IF(سفارشات!H117<>0,سفارشات!D117,\"\")","v":""},{"$f":"IF(سفارشات!H117<>0,سفارشات!E117,\"\")","v":""},{"$f":"IF(سفارشات!H117<>0,سفارشات!F117,\"\")","v":""},{"$f":"IF(C119=\"\",\"\",E119-F119)","v":""}]
[{"$f":"IF(C120=\"\",\"\",ROW()-ROW($A$3))","v":""},{"$f":"IF(سفارشات!H118<>0,سفارشات!C118,\"\")","v":""},{"$f":"IF(سفارشات!H118<>0,سفارشات!B118,\"\")","v":""},{"$f":"IF(سفارشات!H118<>0,سفارشات!D118,\"\")","v":""},{"$f":"IF(سفارشات!H118<>0,سفارشات!E118,\"\")","v":""},{"$f":"IF(سفارشات!H118<>0,سفارشات!F118,\"\")","v":""},{"$f":"IF(C120=\"\",\"\",E120-F120)","v":""}]
[{"$f":"IF(C121=\"\",\"\",ROW()-ROW($A$3))","v":""},{"$f":"IF(سفارشات!H119<>0,سفارشات!C119,\"\")","v":""},{"$f":"IF(سفارشات!H119<>0,سفارشات!B119,\"\")","v":""},{"$f":"IF(سفارشات!H119<>0,سفارشات!D119,\"\")","v":""},{"$f":"IF(سفارشات!H119<>0,سفارشات!E119,\"\")","v":""},{"$f":"IF(سفارشات!H119<>0,سفارشات!F119,\"\")","v":""},{"$f":"IF(C121=\"\",\"\",E121-F121)","v":""}]
[{"$f":"IF(C122=\"\",\"\",ROW()-ROW($A$3))","v":""},{"$f":"IF(سفارشات!H120<>0,سفارشات!C120,\"\")","v":""},{"$f":"IF(سفارشات!H120<>0,سفارشات!B120,\"\")","v":""},{"$f":"IF(سفارشات!H120<>0,سفارشات!D120,\"\")","v":""},{"$f":"IF(سفارشات!H120<>0,سفارشات!E120,\"\")","v":""},{"$f":"IF(سفارشات!H120<>0,سفارشات!F120,\"\")","v":""},{"$f":"IF(C122=\"\",\"\",E122-F122)","v":""}]
[{"$f":"IF(C123=\"\",\"\",ROW()-ROW($A$3))","v":""},{"$f":"IF(سفارشات!H121<>0,سفارشات!C121,\"\")","v":""},{"$f":"IF(سفارشات!H121<>0,سفارشات!B121,\"\")","v":""},{"$f":"IF(سفارشات!H121<>0,سفارشات!D121,\"\")","v":""},{"$f":"IF(سفارشات!H121<>0,سفارشات!E121,\"\")","v":""},{"$f":"IF(سفارشات!H121<>0,سفارشات!F121,\"\")","v":""},{"$f":"IF(C123=\"\",\"\",E123-F123)","v":""}]
[{"$f":"IF(C124=\"\",\"\",ROW()-ROW($A$3))","v":""},{"$f":"IF(سفارشات!H122<>0,سفارشات!C122,\"\")","v":""},{"$f":"IF(سفارشات!H122<>0,سفارشات!B122,\"\")","v":""},{"$f":"IF(سفارشات!H122<>0,سفارشات!D122,\"\")","v":""},{"$f":"IF(سفارشات!H122<>0,سفارشات!E122,\"\")","v":""},{"$f":"IF(سفارشات!H122<>0,سفارشات!F122,\"\")","v":""},{"$f":"IF(C124=\"\",\"\",E124-F124)","v":""}]
[{"$f":"IF(C125=\"\",\"\",ROW()-ROW($A$3))","v":""},{"$f":"IF(سفارشات!H123<>0,سفارشات!C123,\"\")","v":""},{"$f":"IF(سفارشات!H123<>0,سفارشات!B123,\"\")","v":""},{"$f":"IF(سفارشات!H123<>0,سفارشات!D123,\"\")","v":""},{"$f":"IF(سفارشات!H123<>0,سفارشات!E123,\"\")","v":""},{"$f":"IF(سفارشات!H123<>0,سفارشات!F123,\"\")","v":""},{"$f":"IF(C125=\"\",\"\",E125-F125)","v":""}]
[{"$f":"IF(C126=\"\",\"\",ROW()-ROW($A$3))","v":""},{"$f":"IF(سفارشات!H124<>0,سفارشات!C124,\"\")","v":""},{"$f":"IF(سفارشات!H124<>0,سفارشات!B124,\"\")","v":""},{"$f":"IF(سفارشات!H124<>0,سفارشات!D124,\"\")","v":""},{"$f":"IF(سفارشات!H124<>0,سفارشات!E124,\"\")","v":""},{"$f":"IF(سفارشات!H124<>0,سفارشات!F124,\"\")","v":""},{"$f":"IF(C126=\"\",\"\",E126-F126)","v":""}]
[{"$f":"IF(C127=\"\",\"\",ROW()-ROW($A$3))","v":""},{"$f":"IF(سفارشات!H125<>0,سفارشات!C125,\"\")","v":""},{"$f":"IF(سفارشات!H125<>0,سفارشات!B125,\"\")","v":""},{"$f":"IF(سفارشات!H125<>0,سفارشات!D125,\"\")","v":""},{"$f":"IF(سفارشات!H125<>0,سفارشات!E125,\"\")","v":""},{"$f":"IF(سفارشات!H125<>0,سفارشات!F125,\"\")","v":""},{"$f":"IF(C127=\"\",\"\",E127-F127)","v":""}]
[{"$f":"IF(C128=\"\",\"\",ROW()-ROW($A$3))","v":""},{"$f":"IF(سفارشات!H126<>0,سفارشات!C126,\"\")","v":""},{"$f":"IF(سفارشات!H126<>0,سفارشات!B126,\"\")","v":""},{"$f":"IF(سفارشات!H126<>0,سفارشات!D126,\"\")","v":""},{"$f":"IF(سفارشات!H126<>0,سفارشات!E126,\"\")","v":""},{"$f":"IF(سفارشات!H126<>0,سفارشات!F126,\"\")","v":""},{"$f":"IF(C128=\"\",\"\",E128-F128)","v":""}]
[{"$f":"IF(C129=\"\",\"\",ROW()-ROW($A$3))","v":""},{"$f":"IF(سفارشات!H127<>0,سفارشات!C127,\"\")","v":""},{"$f":"IF(سفارشات!H127<>0,سفارشات!B127,\"\")","v":""},{"$f":"IF(سفارشات!H127<>0,سفارشات!D127,\"\")","v":""},{"$f":"IF(سفارشات!H127<>0,سفارشات!E127,\"\")","v":""},{"$f":"IF(سفارشات!H127<>0,سفارشات!F127,\"\")","v":""},{"$f":"IF(C129=\"\",\"\",E129-F129)","v":""}]
[{"$f":"IF(C130=\"\",\"\",ROW()-ROW($A$3))","v":""},{"$f":"IF(سفارشات!H128<>0,سفارشات!C128,\"\")","v":""},{"$f":"IF(سفارشات!H128<>0,سفارشات!B128,\"\")","v":""},{"$f":"IF(سفارشات!H128<>0,سفارشات!D128,\"\")","v":""},{"$f":"IF(سفارشات!H128<>0,سفارشات!E128,\"\")","v":""},{"$f":"IF(سفارشات!H128<>0,سفارشات!F128,\"\")","v":""},{"$f":"IF(C130=\"\",\"\",E130-F130)","v":""}]
[{"$f":"IF(C131=\"\",\"\",ROW()-ROW($A$3))","v":""},{"$f":"IF(سفارشات!H129<>0,سفارشات!C129,\"\")","v":""},{"$f":"IF(سفارشات!H129<>0,سفارشات!B129,\"\")","v":""},{"$f":"IF(سفارشات!H129<>0,سفارشات!D129,\"\")","v":""},{"$f":"IF(سفارشات!H129<>0,سفارشات!E129,\"\")","v":""},{"$f":"IF(سفارشات!H129<>0,سفارشات!F129,\"\")","v":""},{"$f":"IF(C131=\"\",\"\",E131-F131)","v":""}]
[{"$f":"IF(C132=\"\",\"\",ROW()-ROW($A$3))","v":""},{"$f":"IF(سفارشات!H130<>0,سفارشات!C130,\"\")","v":""},{"$f":"IF(سفارشات!H130<>0,سفارشات!B130,\"\")","v":""},{"$f":"IF(سفارشات!H130<>0,سفارشات!D130,\"\")","v":""},{"$f":"IF(سفارشات!H130<>0,سفارشات!E130,\"\")","v":""},{"$f":"IF(سفارشات!H130<>0,سفارشات!F130,\"\")","v":""},{"$f":"IF(C132=\"\",\"\",E132-F132)","v":""}]
[{"$f":"IF(C133=\"\",\"\",ROW()-ROW($A$3))","v":""},{"$f":"IF(سفارشات!H131<>0,سفارشات!C131,\"\")","v":""},{"$f":"IF(سفارشات!H131<>0,سفارشات!B131,\"\")","v":""},{"$f":"IF(سفارشات!H131<>0,سفارشات!D131,\"\")","v":""},{"$f":"IF(سفارشات!H131<>0,سفارشات!E131,\"\")","v":""},{"$f":"IF(سفارشات!H131<>0,سفارشات!F131,\"\")","v":""},{"$f":"IF(C133=\"\",\"\",E133-F133)","v":""}]
[{"$f":"IF(C134=\"\",\"\",ROW()-ROW($A$3))","v":""},{"$f":"IF(سفارشات!H132<>0,سفارشات!C132,\"\")","v":""},{"$f":"IF(سفارشات!H132<>0,سفارشات!B132,\"\")","v":""},{"$f":"IF(سفارشات!H132<>0,سفارشات!D132,\"\")","v":""},{"$f":"IF(سفارشات!H132<>0,سفارشات!E132,\"\")","v":""},{"$f":"IF(سفارشات!H132<>0,سفارشات!F132,\"\")","v":""},{"$f":"IF(C134=\"\",\"\",E134-F134)","v":""}]
[{"$f":"IF(C135=\"\",\"\",ROW()-ROW($A$3))","v":""},{"$f":"IF(سفارشات!H133<>0,سفارشات!C133,\"\")","v":""},{"$f":"IF(سفارشات!H133<>0,سفارشات!B133,\"\")","v":""},{"$f":"IF(سفارشات!H133<>0,سفارشات!D133,\"\")","v":""},{"$f":"IF(سفارشات!H133<>0,سفارشات!E133,\"\")","v":""},{"$f":"IF(سفارشات!H133<>0,سفارشات!F133,\"\")","v":""},{"$f":"IF(C135=\"\",\"\",E135-F135)","v":""}]
[{"$f":"IF(C136=\"\",\"\",ROW()-ROW($A$3))","v":""},{"$f":"IF(سفارشات!H134<>0,سفارشات!C134,\"\")","v":""},{"$f":"IF(سفارشات!H134<>0,سفارشات!B134,\"\")","v":""},{"$f":"IF(سفارشات!H134<>0,سفارشات!D134,\"\")","v":""},{"$f":"IF(سفارشات!H134<>0,سفارشات!E134,\"\")","v":""},{"$f":"IF(سفارشات!H134<>0,سفارشات!F134,\"\")","v":""},{"$f":"IF(C136=\"\",\"\",E136-F136)","v":""}]
[{"$f":"IF(C137=\"\",\"\",ROW()-ROW($A$3))","v":""},{"$f":"IF(سفارشات!H135<>0,سفارشات!C135,\"\")","v":""},{"$f":"IF(سفارشات!H135<>0,سفارشات!B135,\"\")","v":""},{"$f":"IF(سفارشات!H135<>0,سفارشات!D135,\"\")","v":""},{"$f":"IF(سفارشات!H135<>0,سفارشات!E135,\"\")","v":""},{"$f":"IF(سفارشات!H135<>0,سفارشات!F135,\"\")","v":""},{"$f":"IF(C137=\"\",\"\",E137-F137)","v":""}]
[{"$f":"IF(C138=\"\",\"\",ROW()-ROW($A$3))","v":""},{"$f":"IF(سفارشات!H136<>0,سفارشات!C136,\"\")","v":""},{"$f":"IF(سفارشات!H136<>0,سفارشات!B136,\"\")","v":""},{"$f":"IF(سفارشات!H136<>0,سفارشات!D136,\"\")","v":""},{"$f":"IF(سفارشات!H136<>0,سفارشات!E136,\"\")","v":""},{"$f":"IF(سفارشات!H136<>0,سفارشات!F136,\"\")","v":""},{"$f":"IF(C138=\"\",\"\",E138-F138)","v":""}]
[{"$f":"IF(C139=\"\",\"\",ROW()-ROW($A$3))","v":""},{"$f":"IF(سفارشات!H137<>0,سفارشات!C137,\"\")","v":""},{"$f":"IF(سفارشات!H137<>0,سفارشات!B137,\"\")","v":""},{"$f":"IF(سفارشات!H137<>0,سفارشات!D137,\"\")","v":""},{"$f":"IF(سفارشات!H137<>0,سفارشات!E137,\"\")","v":""},{"$f":"IF(سفارشات!H137<>0,سفارشات!F137,\"\")","v":""},{"$f":"IF(C139=\"\",\"\",E139-F139)","v":""}]
[{"$f":"IF(C140=\"\",\"\",ROW()-ROW($A$3))","v":""},{"$f":"IF(سفارشات!H138<>0,سفارشات!C138,\"\")","v":""},{"$f":"IF(سفارشات!H138<>0,سفارشات!B138,\"\")","v":""},{"$f":"IF(سفارشات!H138<>0,سفارشات!D138,\"\")","v":""},{"$f":"IF(سفارشات!H138<>0,سفارشات!E138,\"\")","v":""},{"$f":"IF(سفارشات!H138<>0,سفارشات!F138,\"\")","v":""},{"$f":"IF(C140=\"\",\"\",E140-F140)","v":""}]
[{"$f":"IF(C141=\"\",\"\",ROW()-ROW($A$3))","v":""},{"$f":"IF(سفارشات!H139<>0,سفارشات!C139,\"\")","v":""},{"$f":"IF(سفارشات!H139<>0,سفارشات!B139,\"\")","v":""},{"$f":"IF(سفارشات!H139<>0,سفارشات!D139,\"\")","v":""},{"$f":"IF(سفارشات!H139<>0,سفارشات!E139,\"\")","v":""},{"$f":"IF(سفارشات!H139<>0,سفارشات!F139,\"\")","v":""},{"$f":"IF(C141=\"\",\"\",E141-F141)","v":""}]
[{"$f":"IF(C142=\"\",\"\",ROW()-ROW($A$3))","v":""},{"$f":"IF(سفارشات!H140<>0,سفارشات!C140,\"\")","v":""},{"$f":"IF(سفارشات!H140<>0,سفارشات!B140,\"\")","v":""},{"$f":"IF(سفارشات!H140<>0,سفارشات!D140,\"\")","v":""},{"$f":"IF(سفارشات!H140<>0,سفارشات!E140,\"\")","v":""},{"$f":"IF(سفارشات!H140<>0,سفارشات!F140,\"\")","v":""},{"$f":"IF(C142=\"\",\"\",E142-F142)","v":""}]
[{"$f":"IF(C143=\"\",\"\",ROW()-ROW($A$3))","v":""},{"$f":"IF(سفارشات!H141<>0,سفارشات!C141,\"\")","v":""},{"$f":"IF(سفارشات!H141<>0,سفارشات!B141,\"\")","v":""},{"$f":"IF(سفارشات!H141<>0,سفارشات!D141,\"\")","v":""},{"$f":"IF(سفارشات!H141<>0,سفارشات!E141,\"\")","v":""},{"$f":"IF(سفارشات!H141<>0,سفارشات!F141,\"\")","v":""},{"$f":"IF(C143=\"\",\"\",E143-F143)","v":""}]
[{"$f":"IF(C144=\"\",\"\",ROW()-ROW($A$3))","v":""},{"$f":"IF(سفارشات!H142<>0,سفارشات!C142,\"\")","v":""},{"$f":"IF(سفارشات!H142<>0,سفارشات!B142,\"\")","v":""},{"$f":"IF(سفارشات!H142<>0,سفارشات!D142,\"\")","v":""},{"$f":"IF(سفارشات!H142<>0,سفارشات!E142,\"\")","v":""},{"$f":"IF(سفارشات!H142<>0,سفارشات!F142,\"\")","v":""},{"$f":"IF(C144=\"\",\"\",E144-F144)","v":""}]
[{"$f":"IF(C145=\"\",\"\",ROW()-ROW($A$3))","v":""},{"$f":"IF(سفارشات!H143<>0,سفارشات!C143,\"\")","v":""},{"$f":"IF(سفارشات!H143<>0,سفارشات!B143,\"\")","v":""},{"$f":"IF(سفارشات!H143<>0,سفارشات!D143,\"\")","v":""},{"$f":"IF(سفارشات!H143<>0,سفارشات!E143,\"\")","v":""},{"$f":"IF(سفارشات!H143<>0,سفارشات!F143,\"\")","v":""},{"$f":"IF(C145=\"\",\"\",E145-F145)","v":""}]
[{"$f":"IF(C146=\"\",\"\",ROW()-ROW($A$3))","v":""},{"$f":"IF(سفارشات!H144<>0,سفارشات!C144,\"\")","v":""},{"$f":"IF(سفارشات!H144<>0,سفارشات!B144,\"\")","v":""},{"$f":"IF(سفارشات!H144<>0,سفارشات!D144,\"\")","v":""},{"$f":"IF(سفارشات!H144<>0,سفارشات!E144,\"\")","v":""},{"$f":"IF(سفارشات!H144<>0,سفارشات!F144,\"\")","v":""},{"$f":"IF(C146=\"\",\"\",E146-F146)","v":""}]
[{"$f":"IF(C147=\"\",\"\",ROW()-ROW($A$3))","v":""},{"$f":"IF(سفارشات!H145<>0,سفارشات!C145,\"\")","v":""},{"$f":"IF(سفارشات!H145<>0,سفارشات!B145,\"\")","v":""},{"$f":"IF(سفارشات!H145<>0,سفارشات!D145,\"\")","v":""},{"$f":"IF(سفارشات!H145<>0,سفارشات!E145,\"\")","v":""},{"$f":"IF(سفارشات!H145<>0,سفارشات!F145,\"\")","v":""},{"$f":"IF(C147=\"\",\"\",E147-F147)","v":""}]
[{"$f":"IF(C148=\"\",\"\",ROW()-ROW($A$3))","v":""},{"$f":"IF(سفارشات!H146<>0,سفارشات!C146,\"\")","v":""},{"$f":"IF(سفارشات!H146<>0,سفارشات!B146,\"\")","v":""},{"$f":"IF(سفارشات!H146<>0,سفارشات!D146,\"\")","v":""},{"$f":"IF(سفارشات!H146<>0,سفارشات!E146,\"\")","v":""},{"$f":"IF(سفارشات!H146<>0,سفارشات!F146,\"\")","v":""},{"$f":"IF(C148=\"\",\"\",E148-F148)","v":""}]
[{"$f":"IF(C149=\"\",\"\",ROW()-ROW($A$3))","v":""},{"$f":"IF(سفارشات!H147<>0,سفارشات!C147,\"\")","v":""},{"$f":"IF(سفارشات!H147<>0,سفارشات!B147,\"\")","v":""},{"$f":"IF(سفارشات!H147<>0,سفارشات!D147,\"\")","v":""},{"$f":"IF(سفارشات!H147<>0,سفارشات!E147,\"\")","v":""},{"$f":"IF(سفارشات!H147<>0,سفارشات!F147,\"\")","v":""},{"$f":"IF(C149=\"\",\"\",E149-F149)","v":""}]
[{"$f":"IF(C150=\"\",\"\",ROW()-ROW($A$3))","v":""},{"$f":"IF(سفارشات!H148<>0,سفارشات!C148,\"\")","v":""},{"$f":"IF(سفارشات!H148<>0,سفارشات!B148,\"\")","v":""},{"$f":"IF(سفارشات!H148<>0,سفارشات!D148,\"\")","v":""},{"$f":"IF(سفارشات!H148<>0,سفارشات!E148,\"\")","v":""},{"$f":"IF(سفارشات!H148<>0,سفارشات!F148,\"\")","v":""},{"$f":"IF(C150=\"\",\"\",E150-F150)","v":""}]
[{"$f":"IF(C151=\"\",\"\",ROW()-ROW($A$3))","v":""},{"$f":"IF(سفارشات!H149<>0,سفارشات!C149,\"\")","v":""},{"$f":"IF(سفارشات!H149<>0,سفارشات!B149,\"\")","v":""},{"$f":"IF(سفارشات!H149<>0,سفارشات!D149,\"\")","v":""},{"$f":"IF(سفارشات!H149<>0,سفارشات!E149,\"\")","v":""},{"$f":"IF(سفارشات!H149<>0,سفارشات!F149,\"\")","v":""},{"$f":"IF(C151=\"\",\"\",E151-F151)","v":""}]
[{"$f":"IF(C152=\"\",\"\",ROW()-ROW($A$3))","v":""},{"$f":"IF(سفارشات!H150<>0,سفارشات!C150,\"\")","v":""},{"$f":"IF(سفارشات!H150<>0,سفارشات!B150,\"\")","v":""},{"$f":"IF(سفارشات!H150<>0,سفارشات!D150,\"\")","v":""},{"$f":"IF(سفارشات!H150<>0,سفارشات!E150,\"\")","v":""},{"$f":"IF(سفارشات!H150<>0,سفارشات!F150,\"\")","v":""},{"$f":"IF(C152=\"\",\"\",E152-F152)","v":""}]
[{"$f":"IF(C153=\"\",\"\",ROW()-ROW($A$3))","v":""},{"$f":"IF(سفارشات!H151<>0,سفارشات!C151,\"\")","v":""},{"$f":"IF(سفارشات!H151<>0,سفارشات!B151,\"\")","v":""},{"$f":"IF(سفارشات!H151<>0,سفارشات!D151,\"\")","v":""},{"$f":"IF(سفارشات!H151<>0,سفارشات!E151,\"\")","v":""},{"$f":"IF(سفارشات!H151<>0,سفارشات!F151,\"\")","v":""},{"$f":"IF(C153=\"\",\"\",E153-F153)","v":""}]
[{"$f":"IF(C154=\"\",\"\",ROW()-ROW($A$3))","v":""},{"$f":"IF(سفارشات!H152<>0,سفارشات!C152,\"\")","v":""},{"$f":"IF(سفارشات!H152<>0,سفارشات!B152,\"\")","v":""},{"$f":"IF(سفارشات!H152<>0,سفارشات!D152,\"\")","v":""},{"$f":"IF(سفارشات!H152<>0,سفارشات!E152,\"\")","v":""},{"$f":"IF(سفارشات!H152<>0,سفارشات!F152,\"\")","v":""},{"$f":"IF(C154=\"\",\"\",E154-F154)","v":""}]
[{"$f":"IF(C155=\"\",\"\",ROW()-ROW($A$3))","v":""},{"$f":"IF(سفارشات!H153<>0,سفارشات!C153,\"\")","v":""},{"$f":"IF(سفارشات!H153<>0,سفارشات!B153,\"\")","v":""},{"$f":"IF(سفارشات!H153<>0,سفارشات!D153,\"\")","v":""},{"$f":"IF(سفارشات!H153<>0,سفارشات!E153,\"\")","v":""},{"$f":"IF(سفارشات!H153<>0,سفارشات!F153,\"\")","v":""},{"$f":"IF(C155=\"\",\"\",E155-F155)","v":""}]
[{"$f":"IF(C156=\"\",\"\",ROW()-ROW($A$3))","v":""},{"$f":"IF(سفارشات!H154<>0,سفارشات!C154,\"\")","v":""},{"$f":"IF(سفارشات!H154<>0,سفارشات!B154,\"\")","v":""},{"$f":"IF(سفارشات!H154<>0,سفارشات!D154,\"\")","v":""},{"$f":"IF(سفارشات!H154<>0,سفارشات!E154,\"\")","v":""},{"$f":"IF(سفارشات!H154<>0,سفارشات!F154,\"\")","v":""},{"$f":"IF(C156=\"\",\"\",E156-F156)","v":""}]
[{"$f":"IF(C157=\"\",\"\",ROW()-ROW($A$3))","v":""},{"$f":"IF(سفارشات!H155<>0,سفارشات!C155,\"\")","v":""},{"$f":"IF(سفارشات!H155<>0,سفارشات!B155,\"\")","v":""},{"$f":"IF(سفارشات!H155<>0,سفارشات!D155,\"\")","v":""},{"$f":"IF(سفارشات!H155<>0,سفارشات!E155,\"\")","v":""},{"$f":"IF(سفارشات!H155<>0,سفارشات!F155,\"\")","v":""},{"$f":"IF(C157=\"\",\"\",E157-F157)","v":""}]
[{"$f":"IF(C158=\"\",\"\",ROW()-ROW($A$3))","v":""},{"$f":"IF(سفارشات!H156<>0,سفارشات!C156,\"\")","v":""},{"$f":"IF(سفارشات!H156<>0,سفارشات!B156,\"\")","v":""},{"$f":"IF(سفارشات!H156<>0,سفارشات!D156,\"\")","v":""},{"$f":"IF(سفارشات!H156<>0,سفارشات!E156,\"\")","v":""},{"$f":"IF(سفارشات!H156<>0,سفارشات!F156,\"\")","v":""},{"$f":"IF(C158=\"\",\"\",E158-F158)","v":""}]
[{"$f":"IF(C159=\"\",\"\",ROW()-ROW($A$3))","v":""},{"$f":"IF(سفارشات!H157<>0,سفارشات!C157,\"\")","v":""},{"$f":"IF(سفارشات!H157<>0,سفارشات!B157,\"\")","v":""},{"$f":"IF(سفارشات!H157<>0,سفارشات!D157,\"\")","v":""},{"$f":"IF(سفارشات!H157<>0,سفارشات!E157,\"\")","v":""},{"$f":"IF(سفارشات!H157<>0,سفارشات!F157,\"\")","v":""},{"$f":"IF(C159=\"\",\"\",E159-F159)","v":""}]
[{"$f":"IF(C160=\"\",\"\",ROW()-ROW($A$3))","v":""},{"$f":"IF(سفارشات!H158<>0,سفارشات!C158,\"\")","v":""},{"$f":"IF(سفارشات!H158<>0,سفارشات!B158,\"\")","v":""},{"$f":"IF(سفارشات!H158<>0,سفارشات!D158,\"\")","v":""},{"$f":"IF(سفارشات!H158<>0,سفارشات!E158,\"\")","v":""},{"$f":"IF(سفارشات!H158<>0,سفارشات!F158,\"\")","v":""},{"$f":"IF(C160=\"\",\"\",E160-F160)","v":""}]
[{"$f":"IF(C161=\"\",\"\",ROW()-ROW($A$3))","v":""},{"$f":"IF(سفارشات!H159<>0,سفارشات!C159,\"\")","v":""},{"$f":"IF(سفارشات!H159<>0,سفارشات!B159,\"\")","v":""},{"$f":"IF(سفارشات!H159<>0,سفارشات!D159,\"\")","v":""},{"$f":"IF(سفارشات!H159<>0,سفارشات!E159,\"\")","v":""},{"$f":"IF(سفارشات!H159<>0,سفارشات!F159,\"\")","v":""},{"$f":"IF(C161=\"\",\"\",E161-F161)","v":""}]
[{"$f":"IF(C162=\"\",\"\",ROW()-ROW($A$3))","v":""},{"$f":"IF(سفارشات!H160<>0,سفارشات!C160,\"\")","v":""},{"$f":"IF(سفارشات!H160<>0,سفارشات!B160,\"\")","v":""},{"$f":"IF(سفارشات!H160<>0,سفارشات!D160,\"\")","v":""},{"$f":"IF(سفارشات!H160<>0,سفارشات!E160,\"\")","v":""},{"$f":"IF(سفارشات!H160<>0,سفارشات!F160,\"\")","v":""},{"$f":"IF(C162=\"\",\"\",E162-F162)","v":""}]
[{"$f":"IF(C163=\"\",\"\",ROW()-ROW($A$3))","v":""},{"$f":"IF(سفارشات!H161<>0,سفارشات!C161,\"\")","v":""},{"$f":"IF(سفارشات!H161<>0,سفارشات!B161,\"\")","v":""},{"$f":"IF(سفارشات!H161<>0,سفارشات!D161,\"\")","v":""},{"$f":"IF(سفارشات!H161<>0,سفارشات!E161,\"\")","v":""},{"$f":"IF(سفارشات!H161<>0,سفارشات!F161,\"\")","v":""},{"$f":"IF(C163=\"\",\"\",E163-F163)","v":""}]
[{"$f":"IF(C164=\"\",\"\",ROW()-ROW($A$3))","v":""},{"$f":"IF(سفارشات!H162<>0,سفارشات!C162,\"\")","v":""},{"$f":"IF(سفارشات!H162<>0,سفارشات!B162,\"\")","v":""},{"$f":"IF(سفارشات!H162<>0,سفارشات!D162,\"\")","v":""},{"$f":"IF(سفارشات!H162<>0,سفارشات!E162,\"\")","v":""},{"$f":"IF(سفارشات!H162<>0,سفارشات!F162,\"\")","v":""},{"$f":"IF(C164=\"\",\"\",E164-F164)","v":""}]
[{"$f":"IF(C165=\"\",\"\",ROW()-ROW($A$3))","v":""},{"$f":"IF(سفارشات!H163<>0,سفارشات!C163,\"\")","v":""},{"$f":"IF(سفارشات!H163<>0,سفارشات!B163,\"\")","v":""},{"$f":"IF(سفارشات!H163<>0,سفارشات!D163,\"\")","v":""},{"$f":"IF(سفارشات!H163<>0,سفارشات!E163,\"\")","v":""},{"$f":"IF(سفارشات!H163<>0,سفارشات!F163,\"\")","v":""},{"$f":"IF(C165=\"\",\"\",E165-F165)","v":""}]
[{"$f":"IF(C166=\"\",\"\",ROW()-ROW($A$3))","v":""},{"$f":"IF(سفارشات!H164<>0,سفارشات!C164,\"\")","v":""},{"$f":"IF(سفارشات!H164<>0,سفارشات!B164,\"\")","v":""},{"$f":"IF(سفارشات!H164<>0,سفارشات!D164,\"\")","v":""},{"$f":"IF(سفارشات!H164<>0,سفارشات!E164,\"\")","v":""},{"$f":"IF(سفارشات!H164<>0,سفارشات!F164,\"\")","v":""},{"$f":"IF(C166=\"\",\"\",E166-F166)","v":""}]
[{"$f":"IF(C167=\"\",\"\",ROW()-ROW($A$3))","v":""},{"$f":"IF(سفارشات!H165<>0,سفارشات!C165,\"\")","v":""},{"$f":"IF(سفارشات!H165<>0,سفارشات!B165,\"\")","v":""},{"$f":"IF(سفارشات!H165<>0,سفارشات!D165,\"\")","v":""},{"$f":"IF(سفارشات!H165<>0,سفارشات!E165,\"\")","v":""},{"$f":"IF(سفارشات!H165<>0,سفارشات!F165,\"\")","v":""},{"$f":"IF(C167=\"\",\"\",E167-F167)","v":""}]
[{"$f":"IF(C168=\"\",\"\",ROW()-ROW($A$3))","v":""},{"$f":"IF(سفارشات!H166<>0,سفارشات!C166,\"\")","v":""},{"$f":"IF(سفارشات!H166<>0,سفارشات!B166,\"\")","v":""},{"$f":"IF(سفارشات!H166<>0,سفارشات!D166,\"\")","v":""},{"$f":"IF(سفارشات!H166<>0,سفارشات!E166,\"\")","v":""},{"$f":"IF(سفارشات!H166<>0,سفارشات!F166,\"\")","v":""},{"$f":"IF(C168=\"\",\"\",E168-F168)","v":""}]
[{"$f":"IF(C169=\"\",\"\",ROW()-ROW($A$3))","v":""},{"$f":"IF(سفارشات!H167<>0,سفارشات!C167,\"\")","v":""},{"$f":"IF(سفارشات!H167<>0,سفارشات!B167,\"\")","v":""},{"$f":"IF(سفارشات!H167<>0,سفارشات!D167,\"\")","v":""},{"$f":"IF(سفارشات!H167<>0,سفارشات!E167,\"\")","v":""},{"$f":"IF(سفارشات!H167<>0,سفارشات!F167,\"\")","v":""},{"$f":"IF(C169=\"\",\"\",E169-F169)","v":""}]
[{"$f":"IF(C170=\"\",\"\",ROW()-ROW($A$3))","v":""},{"$f":"IF(سفارشات!H168<>0,سفارشات!C168,\"\")","v":""},{"$f":"IF(سفارشات!H168<>0,سفارشات!B168,\"\")","v":""},{"$f":"IF(سفارشات!H168<>0,سفارشات!D168,\"\")","v":""},{"$f":"IF(سفارشات!H168<>0,سفارشات!E168,\"\")","v":""},{"$f":"IF(سفارشات!H168<>0,سفارشات!F168,\"\")","v":""},{"$f":"IF(C170=\"\",\"\",E170-F170)","v":""}]
[{"$f":"IF(C171=\"\",\"\",ROW()-ROW($A$3))","v":""},{"$f":"IF(سفارشات!H169<>0,سفارشات!C169,\"\")","v":""},{"$f":"IF(سفارشات!H169<>0,سفارشات!B169,\"\")","v":""},{"$f":"IF(سفارشات!H169<>0,سفارشات!D169,\"\")","v":""},{"$f":"IF(سفارشات!H169<>0,سفارشات!E169,\"\")","v":""},{"$f":"IF(سفارشات!H169<>0,سفارشات!F169,\"\")","v":""},{"$f":"IF(C171=\"\",\"\",E171-F171)","v":""}]
[{"$f":"IF(C172=\"\",\"\",ROW()-ROW($A$3))","v":""},{"$f":"IF(سفارشات!H170<>0,سفارشات!C170,\"\")","v":""},{"$f":"IF(سفارشات!H170<>0,سفارشات!B170,\"\")","v":""},{"$f":"IF(سفارشات!H170<>0,سفارشات!D170,\"\")","v":""},{"$f":"IF(سفارشات!H170<>0,سفارشات!E170,\"\")","v":""},{"$f":"IF(سفارشات!H170<>0,سفارشات!F170,\"\")","v":""},{"$f":"IF(C172=\"\",\"\",E172-F172)","v":""}]
[{"$f":"IF(C173=\"\",\"\",ROW()-ROW($A$3))","v":""},{"$f":"IF(سفارشات!H171<>0,سفارشات!C171,\"\")","v":""},{"$f":"IF(سفارشات!H171<>0,سفارشات!B171,\"\")","v":""},{"$f":"IF(سفارشات!H171<>0,سفارشات!D171,\"\")","v":""},{"$f":"IF(سفارشات!H171<>0,سفارشات!E171,\"\")","v":""},{"$f":"IF(سفارشات!H171<>0,سفارشات!F171,\"\")","v":""},{"$f":"IF(C173=\"\",\"\",E173-F173)","v":""}]
[{"$f":"IF(C174=\"\",\"\",ROW()-ROW($A$3))","v":""},{"$f":"IF(سفارشات!H172<>0,سفارشات!C172,\"\")","v":""},{"$f":"IF(سفارشات!H172<>0,سفارشات!B172,\"\")","v":""},{"$f":"IF(سفارشات!H172<>0,سفارشات!D172,\"\")","v":""},{"$f":"IF(سفارشات!H172<>0,سفارشات!E172,\"\")","v":""},{"$f":"IF(سفارشات!H172<>0,سفارشات!F172,\"\")","v":""},{"$f":"IF(C174=\"\",\"\",E174-F174)","v":""}]
[{"$f":"IF(C175=\"\",\"\",ROW()-ROW($A$3))","v":""},{"$f":"IF(سفارشات!H173<>0,سفارشات!C173,\"\")","v":""},{"$f":"IF(سفارشات!H173<>0,سفارشات!B173,\"\")","v":""},{"$f":"IF(سفارشات!H173<>0,سفارشات!D173,\"\")","v":""},{"$f":"IF(سفارشات!H173<>0,سفارشات!E173,\"\")","v":""},{"$f":"IF(سفارشات!H173<>0,سفارشات!F173,\"\")","v":""},{"$f":"IF(C175=\"\",\"\",E175-F175)","v":""}]
[{"$f":"IF(C176=\"\",\"\",ROW()-ROW($A$3))","v":""},{"$f":"IF(سفارشات!H174<>0,سفارشات!C174,\"\")","v":""},{"$f":"IF(سفارشات!H174<>0,سفارشات!B174,\"\")","v":""},{"$f":"IF(سفارشات!H174<>0,سفارشات!D174,\"\")","v":""},{"$f":"IF(سفارشات!H174<>0,سفارشات!E174,\"\")","v":""},{"$f":"IF(سفارشات!H174<>0,سفارشات!F174,\"\")","v":""},{"$f":"IF(C176=\"\",\"\",E176-F176)","v":""}]
[{"$f":"IF(C177=\"\",\"\",ROW()-ROW($A$3))","v":""},{"$f":"IF(سفارشات!H175<>0,سفارشات!C175,\"\")","v":""},{"$f":"IF(سفارشات!H175<>0,سفارشات!B175,\"\")","v":""},{"$f":"IF(سفارشات!H175<>0,سفارشات!D175,\"\")","v":""},{"$f":"IF(سفارشات!H175<>0,سفارشات!E175,\"\")","v":""},{"$f":"IF(سفارشات!H175<>0,سفارشات!F175,\"\")","v":""},{"$f":"IF(C177=\"\",\"\",E177-F177)","v":""}]
[{"$f":"IF(C178=\"\",\"\",ROW()-ROW($A$3))","v":""},{"$f":"IF(سفارشات!H176<>0,سفارشات!C176,\"\")","v":""},{"$f":"IF(سفارشات!H176<>0,سفارشات!B176,\"\")","v":""},{"$f":"IF(سفارشات!H176<>0,سفارشات!D176,\"\")","v":""},{"$f":"IF(سفارشات!H176<>0,سفارشات!E176,\"\")","v":""},{"$f":"IF(سفارشات!H176<>0,سفارشات!F176,\"\")","v":""},{"$f":"IF(C178=\"\",\"\",E178-F178)","v":""}]
[{"$f":"IF(C179=\"\",\"\",ROW()-ROW($A$3))","v":""},{"$f":"IF(سفارشات!H177<>0,سفارشات!C177,\"\")","v":""},{"$f":"IF(سفارشات!H177<>0,سفارشات!B177,\"\")","v":""},{"$f":"IF(سفارشات!H177<>0,سفارشات!D177,\"\")","v":""},{"$f":"IF(سفارشات!H177<>0,سفارشات!E177,\"\")","v":""},{"$f":"IF(سفارشات!H177<>0,سفارشات!F177,\"\")","v":""},{"$f":"IF(C179=\"\",\"\",E179-F179)","v":""}]
[{"$f":"IF(C180=\"\",\"\",ROW()-ROW($A$3))","v":""},{"$f":"IF(سفارشات!H178<>0,سفارشات!C178,\"\")","v":""},{"$f":"IF(سفارشات!H178<>0,سفارشات!B178,\"\")","v":""},{"$f":"IF(سفارشات!H178<>0,سفارشات!D178,\"\")","v":""},{"$f":"IF(سفارشات!H178<>0,سفارشات!E178,\"\")","v":""},{"$f":"IF(سفارشات!H178<>0,سفارشات!F178,\"\")","v":""},{"$f":"IF(C180=\"\",\"\",E180-F180)","v":""}]
[{"$f":"IF(C181=\"\",\"\",ROW()-ROW($A$3))","v":""},{"$f":"IF(سفارشات!H179<>0,سفارشات!C179,\"\")","v":""},{"$f":"IF(سفارشات!H179<>0,سفارشات!B179,\"\")","v":""},{"$f":"IF(سفارشات!H179<>0,سفارشات!D179,\"\")","v":""},{"$f":"IF(سفارشات!H179<>0,سفارشات!E179,\"\")","v":""},{"$f":"IF(سفارشات!H179<>0,سفارشات!F179,\"\")","v":""},{"$f":"IF(C181=\"\",\"\",E181-F181)","v":""}]
[{"$f":"IF(C182=\"\",\"\",ROW()-ROW($A$3))","v":""},{"$f":"IF(سفارشات!H180<>0,سفارشات!C180,\"\")","v":""},{"$f":"IF(سفارشات!H180<>0,سفارشات!B180,\"\")","v":""},{"$f":"IF(سفارشات!H180<>0,سفارشات!D180,\"\")","v":""},{"$f":"IF(سفارشات!H180<>0,سفارشات!E180,\"\")","v":""},{"$f":"IF(سفارشات!H180<>0,سفارشات!F180,\"\")","v":""},{"$f":"IF(C182=\"\",\"\",E182-F182)","v":""}]
[{"$f":"IF(C183=\"\",\"\",ROW()-ROW($A$3))","v":""},{"$f":"IF(سفارشات!H181<>0,سفارشات!C181,\"\")","v":""},{"$f":"IF(سفارشات!H181<>0,سفارشات!B181,\"\")","v":""},{"$f":"IF(سفارشات!H181<>0,سفارشات!D181,\"\")","v":""},{"$f":"IF(سفارشات!H181<>0,سفارشات!E181,\"\")","v":""},{"$f":"IF(سفارشات!H181<>0,سفارشات!F181,\"\")","v":""},{"$f":"IF(C183=\"\",\"\",E183-F183)","v":""}]
[{"$f":"IF(C184=\"\",\"\",ROW()-ROW($A$3))","v":""},{"$f":"IF(سفارشات!H182<>0,سفارشات!C182,\"\")","v":""},{"$f":"IF(سفارشات!H182<>0,سفارشات!B182,\"\")","v":""},{"$f":"IF(سفارشات!H182<>0,سفارشات!D182,\"\")","v":""},{"$f":"IF(سفارشات!H182<>0,سفارشات!E182,\"\")","v":""},{"$f":"IF(سفارشات!H182<>0,سفارشات!F182,\"\")","v":""},{"$f":"IF(C184=\"\",\"\",E184-F184)","v":""}]
[{"$f":"IF(C185=\"\",\"\",ROW()-ROW($A$3))","v":""},{"$f":"IF(سفارشات!H183<>0,سفارشات!C183,\"\")","v":""},{"$f":"IF(سفارشات!H183<>0,سفارشات!B183,\"\")","v":""},{"$f":"IF(سفارشات!H183<>0,سفارشات!D183,\"\")","v":""},{"$f":"IF(سفارشات!H183<>0,سفارشات!E183,\"\")","v":""},{"$f":"IF(سفارشات!H183<>0,سفارشات!F183,\"\")","v":""},{"$f":"IF(C185=\"\",\"\",E185-F185)","v":""}]
[{"$f":"IF(C186=\"\",\"\",ROW()-ROW($A$3))","v":""},{"$f":"IF(سفارشات!H184<>0,سفارشات!C184,\"\")","v":""},{"$f":"IF(سفارشات!H184<>0,سفارشات!B184,\"\")","v":""},{"$f":"IF(سفارشات!H184<>0,سفارشات!D184,\"\")","v":""},{"$f":"IF(سفارشات!H184<>0,سفارشات!E184,\"\")","v":""},{"$f":"IF(سفارشات!H184<>0,سفارشات!F184,\"\")","v":""},{"$f":"IF(C186=\"\",\"\",E186-F186)","v":""}]
[{"$f":"IF(C187=\"\",\"\",ROW()-ROW($A$3))","v":""},{"$f":"IF(سفارشات!H185<>0,سفارشات!C185,\"\")","v":""},{"$f":"IF(سفارشات!H185<>0,سفارشات!B185,\"\")","v":""},{"$f":"IF(سفارشات!H185<>0,سفارشات!D185,\"\")","v":""},{"$f":"IF(سفارشات!H185<>0,سفارشات!E185,\"\")","v":""},{"$f":"IF(سفارشات!H185<>0,سفارشات!F185,\"\")","v":""},{"$f":"IF(C187=\"\",\"\",E187-F187)","v":""}]
[{"$f":"IF(C188=\"\",\"\",ROW()-ROW($A$3))","v":""},{"$f":"IF(سفارشات!H186<>0,سفارشات!C186,\"\")","v":""},{"$f":"IF(سفارشات!H186<>0,سفارشات!B186,\"\")","v":""},{"$f":"IF(سفارشات!H186<>0,سفارشات!D186,\"\")","v":""},{"$f":"IF(سفارشات!H186<>0,سفارشات!E186,\"\")","v":""},{"$f":"IF(سفارشات!H186<>0,سفارشات!F186,\"\")","v":""},{"$f":"IF(C188=\"\",\"\",E188-F188)","v":""}]
[{"$f":"IF(C189=\"\",\"\",ROW()-ROW($A$3))","v":""},{"$f":"IF(سفارشات!H187<>0,سفارشات!C187,\"\")","v":""},{"$f":"IF(سفارشات!H187<>0,سفارشات!B187,\"\")","v":""},{"$f":"IF(سفارشات!H187<>0,سفارشات!D187,\"\")","v":""},{"$f":"IF(سفارشات!H187<>0,سفارشات!E187,\"\")","v":""},{"$f":"IF(سفارشات!H187<>0,سفارشات!F187,\"\")","v":""},{"$f":"IF(C189=\"\",\"\",E189-F189)","v":""}]
[{"$f":"IF(C190=\"\",\"\",ROW()-ROW($A$3))","v":""},{"$f":"IF(سفارشات!H188<>0,سفارشات!C188,\"\")","v":""},{"$f":"IF(سفارشات!H188<>0,سفارشات!B188,\"\")","v":""},{"$f":"IF(سفارشات!H188<>0,سفارشات!D188,\"\")","v":""},{"$f":"IF(سفارشات!H188<>0,سفارشات!E188,\"\")","v":""},{"$f":"IF(سفارشات!H188<>0,سفارشات!F188,\"\")","v":""},{"$f":"IF(C190=\"\",\"\",E190-F190)","v":""}]
[{"$f":"IF(C191=\"\",\"\",ROW()-ROW($A$3))","v":""},{"$f":"IF(سفارشات!H189<>0,سفارشات!C189,\"\")","v":""},{"$f":"IF(سفارشات!H189<>0,سفارشات!B189,\"\")","v":""},{"$f":"IF(سفارشات!H189<>0,سفارشات!D189,\"\")","v":""},{"$f":"IF(سفارشات!H189<>0,سفارشات!E189,\"\")","v":""},{"$f":"IF(سفارشات!H189<>0,سفارشات!F189,\"\")","v":""},{"$f":"IF(C191=\"\",\"\",E191-F191)","v":""}]
[{"$f":"IF(C192=\"\",\"\",ROW()-ROW($A$3))","v":""},{"$f":"IF(سفارشات!H190<>0,سفارشات!C190,\"\")","v":""},{"$f":"IF(سفارشات!H190<>0,سفارشات!B190,\"\")","v":""},{"$f":"IF(سفارشات!H190<>0,سفارشات!D190,\"\")","v":""},{"$f":"IF(سفارشات!H190<>0,سفارشات!E190,\"\")","v":""},{"$f":"IF(سفارشات!H190<>0,سفارشات!F190,\"\")","v":""},{"$f":"IF(C192=\"\",\"\",E192-F192)","v":""}]
[{"$f":"IF(C193=\"\",\"\",ROW()-ROW($A$3))","v":""},{"$f":"IF(سفارشات!H191<>0,سفارشات!C191,\"\")","v":""},{"$f":"IF(سفارشات!H191<>0,سفارشات!B191,\"\")","v":""},{"$f":"IF(سفارشات!H191<>0,سفارشات!D191,\"\")","v":""},{"$f":"IF(سفارشات!H191<>0,سفارشات!E191,\"\")","v":""},{"$f":"IF(سفارشات!H191<>0,سفارشات!F191,\"\")","v":""},{"$f":"IF(C193=\"\",\"\",E193-F193)","v":""}]
[{"$f":"IF(C194=\"\",\"\",ROW()-ROW($A$3))","v":""},{"$f":"IF(سفارشات!H192<>0,سفارشات!C192,\"\")","v":""},{"$f":"IF(سفارشات!H192<>0,سفارشات!B192,\"\")","v":""},{"$f":"IF(سفارشات!H192<>0,سفارشات!D192,\"\")","v":""},{"$f":"IF(سفارشات!H192<>0,سفارشات!E192,\"\")","v":""},{"$f":"IF(سفارشات!H192<>0,سفارشات!F192,\"\")","v":""},{"$f":"IF(C194=\"\",\"\",E194-F194)","v":""}]
[{"$f":"IF(C195=\"\",\"\",ROW()-ROW($A$3))","v":""},{"$f":"IF(سفارشات!H193<>0,سفارشات!C193,\"\")","v":""},{"$f":"IF(سفارشات!H193<>0,سفارشات!B193,\"\")","v":""},{"$f":"IF(سفارشات!H193<>0,سفارشات!D193,\"\")","v":""},{"$f":"IF(سفارشات!H193<>0,سفارشات!E193,\"\")","v":""},{"$f":"IF(سفارشات!H193<>0,سفارشات!F193,\"\")","v":""},{"$f":"IF(C195=\"\",\"\",E195-F195)","v":""}]
[{"$f":"IF(C196=\"\",\"\",ROW()-ROW($A$3))","v":""},{"$f":"IF(سفارشات!H194<>0,سفارشات!C194,\"\")","v":""},{"$f":"IF(سفارشات!H194<>0,سفارشات!B194,\"\")","v":""},{"$f":"IF(سفارشات!H194<>0,سفارشات!D194,\"\")","v":""},{"$f":"IF(سفارشات!H194<>0,سفارشات!E194,\"\")","v":""},{"$f":"IF(سفارشات!H194<>0,سفارشات!F194,\"\")","v":""},{"$f":"IF(C196=\"\",\"\",E196-F196)","v":""}]
[{"$f":"IF(C197=\"\",\"\",ROW()-ROW($A$3))","v":""},{"$f":"IF(سفارشات!H195<>0,سفارشات!C195,\"\")","v":""},{"$f":"IF(سفارشات!H195<>0,سفارشات!B195,\"\")","v":""},{"$f":"IF(سفارشات!H195<>0,سفارشات!D195,\"\")","v":""},{"$f":"IF(سفارشات!H195<>0,سفارشات!E195,\"\")","v":""},{"$f":"IF(سفارشات!H195<>0,سفارشات!F195,\"\")","v":""},{"$f":"IF(C197=\"\",\"\",E197-F197)","v":""}]
[{"$f":"IF(C198=\"\",\"\",ROW()-ROW($A$3))","v":""},{"$f":"IF(سفارشات!H196<>0,سفارشات!C196,\"\")","v":""},{"$f":"IF(سفارشات!H196<>0,سفارشات!B196,\"\")","v":""},{"$f":"IF(سفارشات!H196<>0,سفارشات!D196,\"\")","v":""},{"$f":"IF(سفارشات!H196<>0,سفارشات!E196,\"\")","v":""},{"$f":"IF(سفارشات!H196<>0,سفارشات!F196,\"\")","v":""},{"$f":"IF(C198=\"\",\"\",E198-F198)","v":""}]
[{"$f":"IF(C199=\"\",\"\",ROW()-ROW($A$3))","v":""},{"$f":"IF(سفارشات!H197<>0,سفارشات!C197,\"\")","v":""},{"$f":"IF(سفارشات!H197<>0,سفارشات!B197,\"\")","v":""},{"$f":"IF(سفارشات!H197<>0,سفارشات!D197,\"\")","v":""},{"$f":"IF(سفارشات!H197<>0,سفارشات!E197,\"\")","v":""},{"$f":"IF(سفارشات!H197<>0,سفارشات!F197,\"\")","v":""},{"$f":"IF(C199=\"\",\"\",E199-F199)","v":""}]
[{"$f":"IF(C200=\"\",\"\",ROW()-ROW($A$3))","v":""},{"$f":"IF(سفارشات!H198<>0,سفارشات!C198,\"\")","v":""},{"$f":"IF(سفارشات!H198<>0,سفارشات!B198,\"\")","v":""},{"$f":"IF(سفارشات!H198<>0,سفارشات!D198,\"\")","v":""},{"$f":"IF(سفارشات!H198<>0,سفارشات!E198,\"\")","v":""},{"$f":"IF(سفارشات!H198<>0,سفارشات!F198,\"\")","v":""},{"$f":"IF(C200=\"\",\"\",E200-F200)","v":""}]
[{"$f":"IF(C201=\"\",\"\",ROW()-ROW($A$3))","v":""},{"$f":"IF(سفارشات!H199<>0,سفارشات!C199,\"\")","v":""},{"$f":"IF(سفارشات!H199<>0,سفارشات!B199,\"\")","v":""},{"$f":"IF(سفارشات!H199<>0,سفارشات!D199,\"\")","v":""},{"$f":"IF(سفارشات!H199<>0,سفارشات!E199,\"\")","v":""},{"$f":"IF(سفارشات!H199<>0,سفارشات!F199,\"\")","v":""},{"$f":"IF(C201=\"\",\"\",E201-F201)","v":""}]
[{"$f":"IF(C202=\"\",\"\",ROW()-ROW($A$3))","v":""},{"$f":"IF(سفارشات!H200<>0,سفارشات!C200,\"\")","v":""},{"$f":"IF(سفارشات!H200<>0,سفارشات!B200,\"\")","v":""},{"$f":"IF(سفارشات!H200<>0,سفارشات!D200,\"\")","v":""},{"$f":"IF(سفارشات!H200<>0,سفارشات!E200,\"\")","v":""},{"$f":"IF(سفارشات!H200<>0,سفارشات!F200,\"\")","v":""},{"$f":"IF(C202=\"\",\"\",E202-F202)","v":""}]
[{"$f":"IF(C203=\"\",\"\",ROW()-ROW($A$3))","v":""},{"$f":"IF(سفارشات!H201<>0,سفارشات!C201,\"\")","v":""},{"$f":"IF(سفارشات!H201<>0,سفارشات!B201,\"\")","v":""},{"$f":"IF(سفارشات!H201<>0,سفارشات!D201,\"\")","v":""},{"$f":"IF(سفارشات!H201<>0,سفارشات!E201,\"\")","v":""},{"$f":"IF(سفارشات!H201<>0,سفارشات!F201,\"\")","v":""},{"$f":"IF(C203=\"\",\"\",E203-F203)","v":""}]
[{"$f":"IF(C204=\"\",\"\",ROW()-ROW($A$3))","v":""},{"$f":"IF(سفارشات!H202<>0,سفارشات!C202,\"\")","v":""},{"$f":"IF(سفارشات!H202<>0,سفارشات!B202,\"\")","v":""},{"$f":"IF(سفارشات!H202<>0,سفارشات!D202,\"\")","v":""},{"$f":"IF(سفارشات!H202<>0,سفارشات!E202,\"\")","v":""},{"$f":"IF(سفارشات!H202<>0,سفارشات!F202,\"\")","v":""},{"$f":"IF(C204=\"\",\"\",E204-F204)","v":""}]
[{"$f":"IF(C205=\"\",\"\",ROW()-ROW($A$3))","v":""},{"$f":"IF(سفارشات!H203<>0,سفارشات!C203,\"\")","v":""},{"$f":"IF(سفارشات!H203<>0,سفارشات!B203,\"\")","v":""},{"$f":"IF(سفارشات!H203<>0,سفارشات!D203,\"\")","v":""},{"$f":"IF(سفارشات!H203<>0,سفارشات!E203,\"\")","v":""},{"$f":"IF(سفارشات!H203<>0,سفارشات!F203,\"\")","v":""},{"$f":"IF(C205=\"\",\"\",E205-F205)","v":""}]
[{"$f":"IF(C206=\"\",\"\",ROW()-ROW($A$3))","v":""},{"$f":"IF(سفارشات!H204<>0,سفارشات!C204,\"\")","v":""},{"$f":"IF(سفارشات!H204<>0,سفارشات!B204,\"\")","v":""},{"$f":"IF(سفارشات!H204<>0,سفارشات!D204,\"\")","v":""},{"$f":"IF(سفارشات!H204<>0,سفارشات!E204,\"\")","v":""},{"$f":"IF(سفارشات!H204<>0,سفارشات!F204,\"\")","v":""},{"$f":"IF(C206=\"\",\"\",E206-F206)","v":""}]
[{"$f":"IF(C207=\"\",\"\",ROW()-ROW($A$3))","v":""},{"$f":"IF(سفارشات!H205<>0,سفارشات!C205,\"\")","v":""},{"$f":"IF(سفارشات!H205<>0,سفارشات!B205,\"\")","v":""},{"$f":"IF(سفارشات!H205<>0,سفارشات!D205,\"\")","v":""},{"$f":"IF(سفارشات!H205<>0,سفارشات!E205,\"\")","v":""},{"$f":"IF(سفارشات!H205<>0,سفارشات!F205,\"\")","v":""},{"$f":"IF(C207=\"\",\"\",E207-F207)","v":""}]
[{"$f":"IF(C208=\"\",\"\",ROW()-ROW($A$3))","v":""},{"$f":"IF(سفارشات!H206<>0,سفارشات!C206,\"\")","v":""},{"$f":"IF(سفارشات!H206<>0,سفارشات!B206,\"\")","v":""},{"$f":"IF(سفارشات!H206<>0,سفارشات!D206,\"\")","v":""},{"$f":"IF(سفارشات!H206<>0,سفارشات!E206,\"\")","v":""},{"$f":"IF(سفارشات!H206<>0,سفارشات!F206,\"\")","v":""},{"$f":"IF(C208=\"\",\"\",E208-F208)","v":""}]
[{"$f":"IF(C209=\"\",\"\",ROW()-ROW($A$3))","v":""},{"$f":"IF(سفارشات!H207<>0,سفارشات!C207,\"\")","v":""},{"$f":"IF(سفارشات!H207<>0,سفارشات!B207,\"\")","v":""},{"$f":"IF(سفارشات!H207<>0,سفارشات!D207,\"\")","v":""},{"$f":"IF(سفارشات!H207<>0,سفارشات!E207,\"\")","v":""},{"$f":"IF(سفارشات!H207<>0,سفارشات!F207,\"\")","v":""},{"$f":"IF(C209=\"\",\"\",E209-F209)","v":""}]
[{"$f":"IF(C210=\"\",\"\",ROW()-ROW($A$3))","v":""},{"$f":"IF(سفارشات!H208<>0,سفارشات!C208,\"\")","v":""},{"$f":"IF(سفارشات!H208<>0,سفارشات!B208,\"\")","v":""},{"$f":"IF(سفارشات!H208<>0,سفارشات!D208,\"\")","v":""},{"$f":"IF(سفارشات!H208<>0,سفارشات!E208,\"\")","v":""},{"$f":"IF(سفارشات!H208<>0,سفارشات!F208,\"\")","v":""},{"$f":"IF(C210=\"\",\"\",E210-F210)","v":""}]
[{"$f":"IF(C211=\"\",\"\",ROW()-ROW($A$3))","v":""},{"$f":"IF(سفارشات!H209<>0,سفارشات!C209,\"\")","v":""},{"$f":"IF(سفارشات!H209<>0,سفارشات!B209,\"\")","v":""},{"$f":"IF(سفارشات!H209<>0,سفارشات!D209,\"\")","v":""},{"$f":"IF(سفارشات!H209<>0,سفارشات!E209,\"\")","v":""},{"$f":"IF(سفارشات!H209<>0,سفارشات!F209,\"\")","v":""},{"$f":"IF(C211=\"\",\"\",E211-F211)","v":""}]
[{"$f":"IF(C212=\"\",\"\",ROW()-ROW($A$3))","v":""},{"$f":"IF(سفارشات!H210<>0,سفارشات!C210,\"\")","v":""},{"$f":"IF(سفارشات!H210<>0,سفارشات!B210,\"\")","v":""},{"$f":"IF(سفارشات!H210<>0,سفارشات!D210,\"\")","v":""},{"$f":"IF(سفارشات!H210<>0,سفارشات!E210,\"\")","v":""},{"$f":"IF(سفارشات!H210<>0,سفارشات!F210,\"\")","v":""},{"$f":"IF(C212=\"\",\"\",E212-F212)","v":""}]
[{"$f":"IF(C213=\"\",\"\",ROW()-ROW($A$3))","v":""},{"$f":"IF(سفارشات!H211<>0,سفارشات!C211,\"\")","v":""},{"$f":"IF(سفارشات!H211<>0,سفارشات!B211,\"\")","v":""},{"$f":"IF(سفارشات!H211<>0,سفارشات!D211,\"\")","v":""},{"$f":"IF(سفارشات!H211<>0,سفارشات!E211,\"\")","v":""},{"$f":"IF(سفارشات!H211<>0,سفارشات!F211,\"\")","v":""},{"$f":"IF(C213=\"\",\"\",E213-F213)","v":""}]
[{"$f":"IF(C214=\"\",\"\",ROW()-ROW($A$3))","v":""},{"$f":"IF(سفارشات!H212<>0,سفارشات!C212,\"\")","v":""},{"$f":"IF(سفارشات!H212<>0,سفارشات!B212,\"\")","v":""},{"$f":"IF(سفارشات!H212<>0,سفارشات!D212,\"\")","v":""},{"$f":"IF(سفارشات!H212<>0,سفارشات!E212,\"\")","v":""},{"$f":"IF(سفارشات!H212<>0,سفارشات!F212,\"\")","v":""},{"$f":"IF(C214=\"\",\"\",E214-F214)","v":""}]
[{"$f":"IF(C215=\"\",\"\",ROW()-ROW($A$3))","v":""},{"$f":"IF(سفارشات!H213<>0,سفارشات!C213,\"\")","v":""},{"$f":"IF(سفارشات!H213<>0,سفارشات!B213,\"\")","v":""},{"$f":"IF(سفارشات!H213<>0,سفارشات!D213,\"\")","v":""},{"$f":"IF(سفارشات!H213<>0,سفارشات!E213,\"\")","v":""},{"$f":"IF(سفارشات!H213<>0,سفارشات!F213,\"\")","v":""},{"$f":"IF(C215=\"\",\"\",E215-F215)","v":""}]
[{"$f":"IF(C216=\"\",\"\",ROW()-ROW($A$3))","v":""},{"$f":"IF(سفارشات!H214<>0,سفارشات!C214,\"\")","v":""},{"$f":"IF(سفارشات!H214<>0,سفارشات!B214,\"\")","v":""},{"$f":"IF(سفارشات!H214<>0,سفارشات!D214,\"\")","v":""},{"$f":"IF(سفارشات!H214<>0,سفارشات!E214,\"\")","v":""},{"$f":"IF(سفارشات!H214<>0,سفارشات!F214,\"\")","v":""},{"$f":"IF(C216=\"\",\"\",E216-F216)","v":""}]
[{"$f":"IF(C217=\"\",\"\",ROW()-ROW($A$3))","v":""},{"$f":"IF(سفارشات!H215<>0,سفارشات!C215,\"\")","v":""},{"$f":"IF(سفارشات!H215<>0,سفارشات!B215,\"\")","v":""},{"$f":"IF(سفارشات!H215<>0,سفارشات!D215,\"\")","v":""},{"$f":"IF(سفارشات!H215<>0,سفارشات!E215,\"\")","v":""},{"$f":"IF(سفارشات!H215<>0,سفارشات!F215,\"\")","v":""},{"$f":"IF(C217=\"\",\"\",E217-F217)","v":""}]
[{"$f":"IF(C218=\"\",\"\",ROW()-ROW($A$3))","v":""},{"$f":"IF(سفارشات!H216<>0,سفارشات!C216,\"\")","v":""},{"$f":"IF(سفارشات!H216<>0,سفارشات!B216,\"\")","v":""},{"$f":"IF(سفارشات!H216<>0,سفارشات!D216,\"\")","v":""},{"$f":"IF(سفارشات!H216<>0,سفارشات!E216,\"\")","v":""},{"$f":"IF(سفارشات!H216<>0,سفارشات!F216,\"\")","v":""},{"$f":"IF(C218=\"\",\"\",E218-F218)","v":""}]
[{"$f":"IF(C219=\"\",\"\",ROW()-ROW($A$3))","v":""},{"$f":"IF(سفارشات!H217<>0,سفارشات!C217,\"\")","v":""},{"$f":"IF(سفارشات!H217<>0,سفارشات!B217,\"\")","v":""},{"$f":"IF(سفارشات!H217<>0,سفارشات!D217,\"\")","v":""},{"$f":"IF(سفارشات!H217<>0,سفارشات!E217,\"\")","v":""},{"$f":"IF(سفارشات!H217<>0,سفارشات!F217,\"\")","v":""},{"$f":"IF(C219=\"\",\"\",E219-F219)","v":""}]
[{"$f":"IF(C220=\"\",\"\",ROW()-ROW($A$3))","v":""},{"$f":"IF(سفارشات!H218<>0,سفارشات!C218,\"\")","v":""},{"$f":"IF(سفارشات!H218<>0,سفارشات!B218,\"\")","v":""},{"$f":"IF(سفارشات!H218<>0,سفارشات!D218,\"\")","v":""},{"$f":"IF(سفارشات!H218<>0,سفارشات!E218,\"\")","v":""},{"$f":"IF(سفارشات!H218<>0,سفارشات!F218,\"\")","v":""},{"$f":"IF(C220=\"\",\"\",E220-F220)","v":""}]
[{"$f":"IF(C221=\"\",\"\",ROW()-ROW($A$3))","v":""},{"$f":"IF(سفارشات!H219<>0,سفارشات!C219,\"\")","v":""},{"$f":"IF(سفارشات!H219<>0,سفارشات!B219,\"\")","v":""},{"$f":"IF(سفارشات!H219<>0,سفارشات!D219,\"\")","v":""},{"$f":"IF(سفارشات!H219<>0,سفارشات!E219,\"\")","v":""},{"$f":"IF(سفارشات!H219<>0,سفارشات!F219,\"\")","v":""},{"$f":"IF(C221=\"\",\"\",E221-F221)","v":""}]
[{"$f":"IF(C222=\"\",\"\",ROW()-ROW($A$3))","v":""},{"$f":"IF(سفارشات!H220<>0,سفارشات!C220,\"\")","v":""},{"$f":"IF(سفارشات!H220<>0,سفارشات!B220,\"\")","v":""},{"$f":"IF(سفارشات!H220<>0,سفارشات!D220,\"\")","v":""},{"$f":"IF(سفارشات!H220<>0,سفارشات!E220,\"\")","v":""},{"$f":"IF(سفارشات!H220<>0,سفارشات!F220,\"\")","v":""},{"$f":"IF(C222=\"\",\"\",E222-F222)","v":""}]
[{"$f":"IF(C223=\"\",\"\",ROW()-ROW($A$3))","v":""},{"$f":"IF(سفارشات!H221<>0,سفارشات!C221,\"\")","v":""},{"$f":"IF(سفارشات!H221<>0,سفارشات!B221,\"\")","v":""},{"$f":"IF(سفارشات!H221<>0,سفارشات!D221,\"\")","v":""},{"$f":"IF(سفارشات!H221<>0,سفارشات!E221,\"\")","v":""},{"$f":"IF(سفارشات!H221<>0,سفارشات!F221,\"\")","v":""},{"$f":"IF(C223=\"\",\"\",E223-F223)","v":""}]
[{"$f":"IF(C224=\"\",\"\",ROW()-ROW($A$3))","v":""},{"$f":"IF(سفارشات!H222<>0,سفارشات!C222,\"\")","v":""},{"$f":"IF(سفارشات!H222<>0,سفارشات!B222,\"\")","v":""},{"$f":"IF(سفارشات!H222<>0,سفارشات!D222,\"\")","v":""},{"$f":"IF(سفارشات!H222<>0,سفارشات!E222,\"\")","v":""},{"$f":"IF(سفارشات!H222<>0,سفارشات!F222,\"\")","v":""},{"$f":"IF(C224=\"\",\"\",E224-F224)","v":""}]
[{"$f":"IF(C225=\"\",\"\",ROW()-ROW($A$3))","v":""},{"$f":"IF(سفارشات!H223<>0,سفارشات!C223,\"\")","v":""},{"$f":"IF(سفارشات!H223<>0,سفارشات!B223,\"\")","v":""},{"$f":"IF(سفارشات!H223<>0,سفارشات!D223,\"\")","v":""},{"$f":"IF(سفارشات!H223<>0,سفارشات!E223,\"\")","v":""},{"$f":"IF(سفارشات!H223<>0,سفارشات!F223,\"\")","v":""},{"$f":"IF(C225=\"\",\"\",E225-F225)","v":""}]
[{"$f":"IF(C226=\"\",\"\",ROW()-ROW($A$3))","v":""},{"$f":"IF(سفارشات!H224<>0,سفارشات!C224,\"\")","v":""},{"$f":"IF(سفارشات!H224<>0,سفارشات!B224,\"\")","v":""},{"$f":"IF(سفارشات!H224<>0,سفارشات!D224,\"\")","v":""},{"$f":"IF(سفارشات!H224<>0,سفارشات!E224,\"\")","v":""},{"$f":"IF(سفارشات!H224<>0,سفارشات!F224,\"\")","v":""},{"$f":"IF(C226=\"\",\"\",E226-F226)","v":""}]
[{"$f":"IF(C227=\"\",\"\",ROW()-ROW($A$3))","v":""},{"$f":"IF(سفارشات!H225<>0,سفارشات!C225,\"\")","v":""},{"$f":"IF(سفارشات!H225<>0,سفارشات!B225,\"\")","v":""},{"$f":"IF(سفارشات!H225<>0,سفارشات!D225,\"\")","v":""},{"$f":"IF(سفارشات!H225<>0,سفارشات!E225,\"\")","v":""},{"$f":"IF(سفارشات!H225<>0,سفارشات!F225,\"\")","v":""},{"$f":"IF(C227=\"\",\"\",E227-F227)","v":""}]
[{"$f":"IF(C228=\"\",\"\",ROW()-ROW($A$3))","v":""},{"$f":"IF(سفارشات!H226<>0,سفارشات!C226,\"\")","v":""},{"$f":"IF(سفارشات!H226<>0,سفارشات!B226,\"\")","v":""},{"$f":"IF(سفارشات!H226<>0,سفارشات!D226,\"\")","v":""},{"$f":"IF(سفارشات!H226<>0,سفارشات!E226,\"\")","v":""},{"$f":"IF(سفارشات!H226<>0,سفارشات!F226,\"\")","v":""},{"$f":"IF(C228=\"\",\"\",E228-F228)","v":""}]
[{"$f":"IF(C229=\"\",\"\",ROW()-ROW($A$3))","v":""},{"$f":"IF(سفارشات!H227<>0,سفارشات!C227,\"\")","v":""},{"$f":"IF(سفارشات!H227<>0,سفارشات!B227,\"\")","v":""},{"$f":"IF(سفارشات!H227<>0,سفارشات!D227,\"\")","v":""},{"$f":"IF(سفارشات!H227<>0,سفارشات!E227,\"\")","v":""},{"$f":"IF(سفارشات!H227<>0,سفارشات!F227,\"\")","v":""},{"$f":"IF(C229=\"\",\"\",E229-F229)","v":""}]
[{"$f":"IF(C230=\"\",\"\",ROW()-ROW($A$3))","v":""},{"$f":"IF(سفارشات!H228<>0,سفارشات!C228,\"\")","v":""},{"$f":"IF(سفارشات!H228<>0,سفارشات!B228,\"\")","v":""},{"$f":"IF(سفارشات!H228<>0,سفارشات!D228,\"\")","v":""},{"$f":"IF(سفارشات!H228<>0,سفارشات!E228,\"\")","v":""},{"$f":"IF(سفارشات!H228<>0,سفارشات!F228,\"\")","v":""},{"$f":"IF(C230=\"\",\"\",E230-F230)","v":""}]
[{"$f":"IF(C231=\"\",\"\",ROW()-ROW($A$3))","v":""},{"$f":"IF(سفارشات!H229<>0,سفارشات!C229,\"\")","v":""},{"$f":"IF(سفارشات!H229<>0,سفارشات!B229,\"\")","v":""},{"$f":"IF(سفارشات!H229<>0,سفارشات!D229,\"\")","v":""},{"$f":"IF(سفارشات!H229<>0,سفارشات!E229,\"\")","v":""},{"$f":"IF(سفارشات!H229<>0,سفارشات!F229,\"\")","v":""},{"$f":"IF(C231=\"\",\"\",E231-F231)","v":""}]
[{"$f":"IF(C232=\"\",\"\",ROW()-ROW($A$3))","v":""},{"$f":"IF(سفارشات!H230<>0,سفارشات!C230,\"\")","v":""},{"$f":"IF(سفارشات!H230<>0,سفارشات!B230,\"\")","v":""},{"$f":"IF(سفارشات!H230<>0,سفارشات!D230,\"\")","v":""},{"$f":"IF(سفارشات!H230<>0,سفارشات!E230,\"\")","v":""},{"$f":"IF(سفارشات!H230<>0,سفارشات!F230,\"\")","v":""},{"$f":"IF(C232=\"\",\"\",E232-F232)","v":""}]
[{"$f":"IF(C233=\"\",\"\",ROW()-ROW($A$3))","v":""},{"$f":"IF(سفارشات!H231<>0,سفارشات!C231,\"\")","v":""},{"$f":"IF(سفارشات!H231<>0,سفارشات!B231,\"\")","v":""},{"$f":"IF(سفارشات!H231<>0,سفارشات!D231,\"\")","v":""},{"$f":"IF(سفارشات!H231<>0,سفارشات!E231,\"\")","v":""},{"$f":"IF(سفارشات!H231<>0,سفارشات!F231,\"\")","v":""},{"$f":"IF(C233=\"\",\"\",E233-F233)","v":""}]
[{"$f":"IF(C234=\"\",\"\",ROW()-ROW($A$3))","v":""},{"$f":"IF(سفارشات!H232<>0,سفارشات!C232,\"\")","v":""},{"$f":"IF(سفارشات!H232<>0,سفارشات!B232,\"\")","v":""},{"$f":"IF(سفارشات!H232<>0,سفارشات!D232,\"\")","v":""},{"$f":"IF(سفارشات!H232<>0,سفارشات!E232,\"\")","v":""},{"$f":"IF(سفارشات!H232<>0,سفارشات!F232,\"\")","v":""},{"$f":"IF(C234=\"\",\"\",E234-F234)","v":""}]
[{"$f":"IF(C235=\"\",\"\",ROW()-ROW($A$3))","v":""},{"$f":"IF(سفارشات!H233<>0,سفارشات!C233,\"\")","v":""},{"$f":"IF(سفارشات!H233<>0,سفارشات!B233,\"\")","v":""},{"$f":"IF(سفارشات!H233<>0,سفارشات!D233,\"\")","v":""},{"$f":"IF(سفارشات!H233<>0,سفارشات!E233,\"\")","v":""},{"$f":"IF(سفارشات!H233<>0,سفارشات!F233,\"\")","v":""},{"$f":"IF(C235=\"\",\"\",E235-F235)","v":""}]
[{"$f":"IF(C236=\"\",\"\",ROW()-ROW($A$3))","v":""},{"$f":"IF(سفارشات!H234<>0,سفارشات!C234,\"\")","v":""},{"$f":"IF(سفارشات!H234<>0,سفارشات!B234,\"\")","v":""},{"$f":"IF(سفارشات!H234<>0,سفارشات!D234,\"\")","v":""},{"$f":"IF(سفارشات!H234<>0,سفارشات!E234,\"\")","v":""},{"$f":"IF(سفارشات!H234<>0,سفارشات!F234,\"\")","v":""},{"$f":"IF(C236=\"\",\"\",E236-F236)","v":""}]
[{"$f":"IF(C237=\"\",\"\",ROW()-ROW($A$3))","v":""},{"$f":"IF(سفارشات!H235<>0,سفارشات!C235,\"\")","v":""},{"$f":"IF(سفارشات!H235<>0,سفارشات!B235,\"\")","v":""},{"$f":"IF(سفارشات!H235<>0,سفارشات!D235,\"\")","v":""},{"$f":"IF(سفارشات!H235<>0,سفارشات!E235,\"\")","v":""},{"$f":"IF(سفارشات!H235<>0,سفارشات!F235,\"\")","v":""},{"$f":"IF(C237=\"\",\"\",E237-F237)","v":""}]
[{"$f":"IF(C238=\"\",\"\",ROW()-ROW($A$3))","v":""},{"$f":"IF(سفارشات!H236<>0,سفارشات!C236,\"\")","v":""},{"$f":"IF(سفارشات!H236<>0,سفارشات!B236,\"\")","v":""},{"$f":"IF(سفارشات!H236<>0,سفارشات!D236,\"\")","v":""},{"$f":"IF(سفارشات!H236<>0,سفارشات!E236,\"\")","v":""},{"$f":"IF(سفارشات!H236<>0,سفارشات!F236,\"\")","v":""},{"$f":"IF(C238=\"\",\"\",E238-F238)","v":""}]
[{"$f":"IF(C239=\"\",\"\",ROW()-ROW($A$3))","v":""},{"$f":"IF(سفارشات!H237<>0,سفارشات!C237,\"\")","v":""},{"$f":"IF(سفارشات!H237<>0,سفارشات!B237,\"\")","v":""},{"$f":"IF(سفارشات!H237<>0,سفارشات!D237,\"\")","v":""},{"$f":"IF(سفارشات!H237<>0,سفارشات!E237,\"\")","v":""},{"$f":"IF(سفارشات!H237<>0,سفارشات!F237,\"\")","v":""},{"$f":"IF(C239=\"\",\"\",E239-F239)","v":""}]
[{"$f":"IF(C240=\"\",\"\",ROW()-ROW($A$3))","v":""},{"$f":"IF(سفارشات!H238<>0,سفارشات!C238,\"\")","v":""},{"$f":"IF(سفارشات!H238<>0,سفارشات!B238,\"\")","v":""},{"$f":"IF(سفارشات!H238<>0,سفارشات!D238,\"\")","v":""},{"$f":"IF(سفارشات!H238<>0,سفارشات!E238,\"\")","v":""},{"$f":"IF(سفارشات!H238<>0,سفارشات!F238,\"\")","v":""},{"$f":"IF(C240=\"\",\"\",E240-F240)","v":""}]
[{"$f":"IF(C241=\"\",\"\",ROW()-ROW($A$3))","v":""},{"$f":"IF(سفارشات!H239<>0,سفارشات!C239,\"\")","v":""},{"$f":"IF(سفارشات!H239<>0,سفارشات!B239,\"\")","v":""},{"$f":"IF(سفارشات!H239<>0,سفارشات!D239,\"\")","v":""},{"$f":"IF(سفارشات!H239<>0,سفارشات!E239,\"\")","v":""},{"$f":"IF(سفارشات!H239<>0,سفارشات!F239,\"\")","v":""},{"$f":"IF(C241=\"\",\"\",E241-F241)","v":""}]
[{"$f":"IF(C242=\"\",\"\",ROW()-ROW($A$3))","v":""},{"$f":"IF(سفارشات!H240<>0,سفارشات!C240,\"\")","v":""},{"$f":"IF(سفارشات!H240<>0,سفارشات!B240,\"\")","v":""},{"$f":"IF(سفارشات!H240<>0,سفارشات!D240,\"\")","v":""},{"$f":"IF(سفارشات!H240<>0,سفارشات!E240,\"\")","v":""},{"$f":"IF(سفارشات!H240<>0,سفارشات!F240,\"\")","v":""},{"$f":"IF(C242=\"\",\"\",E242-F242)","v":""}]
[{"$f":"IF(C243=\"\",\"\",ROW()-ROW($A$3))","v":""},{"$f":"IF(سفارشات!H241<>0,سفارشات!C241,\"\")","v":""},{"$f":"IF(سفارشات!H241<>0,سفارشات!B241,\"\")","v":""},{"$f":"IF(سفارشات!H241<>0,سفارشات!D241,\"\")","v":""},{"$f":"IF(سفارشات!H241<>0,سفارشات!E241,\"\")","v":""},{"$f":"IF(سفارشات!H241<>0,سفارشات!F241,\"\")","v":""},{"$f":"IF(C243=\"\",\"\",E243-F243)","v":""}]
[{"$f":"IF(C244=\"\",\"\",ROW()-ROW($A$3))","v":""},{"$f":"IF(سفارشات!H242<>0,سفارشات!C242,\"\")","v":""},{"$f":"IF(سفارشات!H242<>0,سفارشات!B242,\"\")","v":""},{"$f":"IF(سفارشات!H242<>0,سفارشات!D242,\"\")","v":""},{"$f":"IF(سفارشات!H242<>0,سفارشات!E242,\"\")","v":""},{"$f":"IF(سفارشات!H242<>0,سفارشات!F242,\"\")","v":""},{"$f":"IF(C244=\"\",\"\",E244-F244)","v":""}]
[{"$f":"IF(C245=\"\",\"\",ROW()-ROW($A$3))","v":""},{"$f":"IF(سفارشات!H243<>0,سفارشات!C243,\"\")","v":""},{"$f":"IF(سفارشات!H243<>0,سفارشات!B243,\"\")","v":""},{"$f":"IF(سفارشات!H243<>0,سفارشات!D243,\"\")","v":""},{"$f":"IF(سفارشات!H243<>0,سفارشات!E243,\"\")","v":""},{"$f":"IF(سفارشات!H243<>0,سفارشات!F243,\"\")","v":""},{"$f":"IF(C245=\"\",\"\",E245-F245)","v":""}]
[{"$f":"IF(C246=\"\",\"\",ROW()-ROW($A$3))","v":""},{"$f":"IF(سفارشات!H244<>0,سفارشات!C244,\"\")","v":""},{"$f":"IF(سفارشات!H244<>0,سفارشات!B244,\"\")","v":""},{"$f":"IF(سفارشات!H244<>0,سفارشات!D244,\"\")","v":""},{"$f":"IF(سفارشات!H244<>0,سفارشات!E244,\"\")","v":""},{"$f":"IF(سفارشات!H244<>0,سفارشات!F244,\"\")","v":""},{"$f":"IF(C246=\"\",\"\",E246-F246)","v":""}]
[{"$f":"IF(C247=\"\",\"\",ROW()-ROW($A$3))","v":""},{"$f":"IF(سفارشات!H245<>0,سفارشات!C245,\"\")","v":""},{"$f":"IF(سفارشات!H245<>0,سفارشات!B245,\"\")","v":""},{"$f":"IF(سفارشات!H245<>0,سفارشات!D245,\"\")","v":""},{"$f":"IF(سفارشات!H245<>0,سفارشات!E245,\"\")","v":""},{"$f":"IF(سفارشات!H245<>0,سفارشات!F245,\"\")","v":""},{"$f":"IF(C247=\"\",\"\",E247-F247)","v":""}]
[{"$f":"IF(C248=\"\",\"\",ROW()-ROW($A$3))","v":""},{"$f":"IF(سفارشات!H246<>0,سفارشات!C246,\"\")","v":""},{"$f":"IF(سفارشات!H246<>0,سفارشات!B246,\"\")","v":""},{"$f":"IF(سفارشات!H246<>0,سفارشات!D246,\"\")","v":""},{"$f":"IF(سفارشات!H246<>0,سفارشات!E246,\"\")","v":""},{"$f":"IF(سفارشات!H246<>0,سفارشات!F246,\"\")","v":""},{"$f":"IF(C248=\"\",\"\",E248-F248)","v":""}]
[{"$f":"IF(C249=\"\",\"\",ROW()-ROW($A$3))","v":""},{"$f":"IF(سفارشات!H247<>0,سفارشات!C247,\"\")","v":""},{"$f":"IF(سفارشات!H247<>0,سفارشات!B247,\"\")","v":""},{"$f":"IF(سفارشات!H247<>0,سفارشات!D247,\"\")","v":""},{"$f":"IF(سفارشات!H247<>0,سفارشات!E247,\"\")","v":""},{"$f":"IF(سفارشات!H247<>0,سفارشات!F247,\"\")","v":""},{"$f":"IF(C249=\"\",\"\",E249-F249)","v":""}]
[{"$f":"IF(C250=\"\",\"\",ROW()-ROW($A$3))","v":""},{"$f":"IF(سفارشات!H248<>0,سفارشات!C248,\"\")","v":""},{"$f":"IF(سفارشات!H248<>0,سفارشات!B248,\"\")","v":""},{"$f":"IF(سفارشات!H248<>0,سفارشات!D248,\"\")","v":""},{"$f":"IF(سفارشات!H248<>0,سفارشات!E248,\"\")","v":""},{"$f":"IF(سفارشات!H248<>0,سفارشات!F248,\"\")","v":""},{"$f":"IF(C250=\"\",\"\",E250-F250)","v":""}]
[{"$f":"IF(C251=\"\",\"\",ROW()-ROW($A$3))","v":""},{"$f":"IF(سفارشات!H249<>0,سفارشات!C249,\"\")","v":""},{"$f":"IF(سفارشات!H249<>0,سفارشات!B249,\"\")","v":""},{"$f":"IF(سفارشات!H249<>0,سفارشات!D249,\"\")","v":""},{"$f":"IF(سفارشات!H249<>0,سفارشات!E249,\"\")","v":""},{"$f":"IF(سفارشات!H249<>0,سفارشات!F249,\"\")","v":""},{"$f":"IF(C251=\"\",\"\",E251-F251)","v":""}]
[{"$f":"IF(C252=\"\",\"\",ROW()-ROW($A$3))","v":""},{"$f":"IF(سفارشات!H250<>0,سفارشات!C250,\"\")","v":""},{"$f":"IF(سفارشات!H250<>0,سفارشات!B250,\"\")","v":""},{"$f":"IF(سفارشات!H250<>0,سفارشات!D250,\"\")","v":""},{"$f":"IF(سفارشات!H250<>0,سفارشات!E250,\"\")","v":""},{"$f":"IF(سفارشات!H250<>0,سفارشات!F250,\"\")","v":""},{"$f":"IF(C252=\"\",\"\",E252-F252)","v":""}]
[{"$f":"IF(C253=\"\",\"\",ROW()-ROW($A$3))","v":""},{"$f":"IF(سفارشات!H251<>0,سفارشات!C251,\"\")","v":""},{"$f":"IF(سفارشات!H251<>0,سفارشات!B251,\"\")","v":""},{"$f":"IF(سفارشات!H251<>0,سفارشات!D251,\"\")","v":""},{"$f":"IF(سفارشات!H251<>0,سفارشات!E251,\"\")","v":""},{"$f":"IF(سفارشات!H251<>0,سفارشات!F251,\"\")","v":""},{"$f":"IF(C253=\"\",\"\",E253-F253)","v":""}]
[{"$f":"IF(C254=\"\",\"\",ROW()-ROW($A$3))","v":""},{"$f":"IF(سفارشات!H252<>0,سفارشات!C252,\"\")","v":""},{"$f":"IF(سفارشات!H252<>0,سفارشات!B252,\"\")","v":""},{"$f":"IF(سفارشات!H252<>0,سفارشات!D252,\"\")","v":""},{"$f":"IF(سفارشات!H252<>0,سفارشات!E252,\"\")","v":""},{"$f":"IF(سفارشات!H252<>0,سفارشات!F252,\"\")","v":""},{"$f":"IF(C254=\"\",\"\",E254-F254)","v":""}]
[{"$f":"IF(C255=\"\",\"\",ROW()-ROW($A$3))","v":""},{"$f":"IF(سفارشات!H253<>0,سفارشات!C253,\"\")","v":""},{"$f":"IF(سفارشات!H253<>0,سفارشات!B253,\"\")","v":""},{"$f":"IF(سفارشات!H253<>0,سفارشات!D253,\"\")","v":""},{"$f":"IF(سفارشات!H253<>0,سفارشات!E253,\"\")","v":""},{"$f":"IF(سفارشات!H253<>0,سفارشات!F253,\"\")","v":""},{"$f":"IF(C255=\"\",\"\",E255-F255)","v":""}]
[{"$f":"IF(C256=\"\",\"\",ROW()-ROW($A$3))","v":""},{"$f":"IF(سفارشات!H254<>0,سفارشات!C254,\"\")","v":""},{"$f":"IF(سفارشات!H254<>0,سفارشات!B254,\"\")","v":""},{"$f":"IF(سفارشات!H254<>0,سفارشات!D254,\"\")","v":""},{"$f":"IF(سفارشات!H254<>0,سفارشات!E254,\"\")","v":""},{"$f":"IF(سفارشات!H254<>0,سفارشات!F254,\"\")","v":""},{"$f":"IF(C256=\"\",\"\",E256-F256)","v":""}]
[{"$f":"IF(C257=\"\",\"\",ROW()-ROW($A$3))","v":""},{"$f":"IF(سفارشات!H255<>0,سفارشات!C255,\"\")","v":""},{"$f":"IF(سفارشات!H255<>0,سفارشات!B255,\"\")","v":""},{"$f":"IF(سفارشات!H255<>0,سفارشات!D255,\"\")","v":""},{"$f":"IF(سفارشات!H255<>0,سفارشات!E255,\"\")","v":""},{"$f":"IF(سفارشات!H255<>0,سفارشات!F255,\"\")","v":""},{"$f":"IF(C257=\"\",\"\",E257-F257)","v":""}]
[{"$f":"IF(C258=\"\",\"\",ROW()-ROW($A$3))","v":""},{"$f":"IF(سفارشات!H256<>0,سفارشات!C256,\"\")","v":""},{"$f":"IF(سفارشات!H256<>0,سفارشات!B256,\"\")","v":""},{"$f":"IF(سفارشات!H256<>0,سفارشات!D256,\"\")","v":""},{"$f":"IF(سفارشات!H256<>0,سفارشات!E256,\"\")","v":""},{"$f":"IF(سفارشات!H256<>0,سفارشات!F256,\"\")","v":""},{"$f":"IF(C258=\"\",\"\",E258-F258)","v":""}]
[{"$f":"IF(C259=\"\",\"\",ROW()-ROW($A$3))","v":""},{"$f":"IF(سفارشات!H257<>0,سفارشات!C257,\"\")","v":""},{"$f":"IF(سفارشات!H257<>0,سفارشات!B257,\"\")","v":""},{"$f":"IF(سفارشات!H257<>0,سفارشات!D257,\"\")","v":""},{"$f":"IF(سفارشات!H257<>0,سفارشات!E257,\"\")","v":""},{"$f":"IF(سفارشات!H257<>0,سفارشات!F257,\"\")","v":""},{"$f":"IF(C259=\"\",\"\",E259-F259)","v":""}]
[{"$f":"IF(C260=\"\",\"\",ROW()-ROW($A$3))","v":""},{"$f":"IF(سفارشات!H258<>0,سفارشات!C258,\"\")","v":""},{"$f":"IF(سفارشات!H258<>0,سفارشات!B258,\"\")","v":""},{"$f":"IF(سفارشات!H258<>0,سفارشات!D258,\"\")","v":""},{"$f":"IF(سفارشات!H258<>0,سفارشات!E258,\"\")","v":""},{"$f":"IF(سفارشات!H258<>0,سفارشات!F258,\"\")","v":""},{"$f":"IF(C260=\"\",\"\",E260-F260)","v":""}]
[{"$f":"IF(C261=\"\",\"\",ROW()-ROW($A$3))","v":""},{"$f":"IF(سفارشات!H259<>0,سفارشات!C259,\"\")","v":""},{"$f":"IF(سفارشات!H259<>0,سفارشات!B259,\"\")","v":""},{"$f":"IF(سفارشات!H259<>0,سفارشات!D259,\"\")","v":""},{"$f":"IF(سفارشات!H259<>0,سفارشات!E259,\"\")","v":""},{"$f":"IF(سفارشات!H259<>0,سفارشات!F259,\"\")","v":""},{"$f":"IF(C261=\"\",\"\",E261-F261)","v":""}]
[{"$f":"IF(C262=\"\",\"\",ROW()-ROW($A$3))","v":""},{"$f":"IF(سفارشات!H260<>0,سفارشات!C260,\"\")","v":""},{"$f":"IF(سفارشات!H260<>0,سفارشات!B260,\"\")","v":""},{"$f":"IF(سفارشات!H260<>0,سفارشات!D260,\"\")","v":""},{"$f":"IF(سفارشات!H260<>0,سفارشات!E260,\"\")","v":""},{"$f":"IF(سفارشات!H260<>0,سفارشات!F260,\"\")","v":""},{"$f":"IF(C262=\"\",\"\",E262-F262)","v":""}]
[{"$f":"IF(C263=\"\",\"\",ROW()-ROW($A$3))","v":""},{"$f":"IF(سفارشات!H261<>0,سفارشات!C261,\"\")","v":""},{"$f":"IF(سفارشات!H261<>0,سفارشات!B261,\"\")","v":""},{"$f":"IF(سفارشات!H261<>0,سفارشات!D261,\"\")","v":""},{"$f":"IF(سفارشات!H261<>0,سفارشات!E261,\"\")","v":""},{"$f":"IF(سفارشات!H261<>0,سفارشات!F261,\"\")","v":""},{"$f":"IF(C263=\"\",\"\",E263-F263)","v":""}]
[{"$f":"IF(C264=\"\",\"\",ROW()-ROW($A$3))","v":""},{"$f":"IF(سفارشات!H262<>0,سفارشات!C262,\"\")","v":""},{"$f":"IF(سفارشات!H262<>0,سفارشات!B262,\"\")","v":""},{"$f":"IF(سفارشات!H262<>0,سفارشات!D262,\"\")","v":""},{"$f":"IF(سفارشات!H262<>0,سفارشات!E262,\"\")","v":""},{"$f":"IF(سفارشات!H262<>0,سفارشات!F262,\"\")","v":""},{"$f":"IF(C264=\"\",\"\",E264-F264)","v":""}]
[{"$f":"IF(C265=\"\",\"\",ROW()-ROW($A$3))","v":""},{"$f":"IF(سفارشات!H263<>0,سفارشات!C263,\"\")","v":""},{"$f":"IF(سفارشات!H263<>0,سفارشات!B263,\"\")","v":""},{"$f":"IF(سفارشات!H263<>0,سفارشات!D263,\"\")","v":""},{"$f":"IF(سفارشات!H263<>0,سفارشات!E263,\"\")","v":""},{"$f":"IF(سفارشات!H263<>0,سفارشات!F263,\"\")","v":""},{"$f":"IF(C265=\"\",\"\",E265-F265)","v":""}]
[{"$f":"IF(C266=\"\",\"\",ROW()-ROW($A$3))","v":""},{"$f":"IF(سفارشات!H264<>0,سفارشات!C264,\"\")","v":""},{"$f":"IF(سفارشات!H264<>0,سفارشات!B264,\"\")","v":""},{"$f":"IF(سفارشات!H264<>0,سفارشات!D264,\"\")","v":""},{"$f":"IF(سفارشات!H264<>0,سفارشات!E264,\"\")","v":""},{"$f":"IF(سفارشات!H264<>0,سفارشات!F264,\"\")","v":""},{"$f":"IF(C266=\"\",\"\",E266-F266)","v":""}]
[{"$f":"IF(C267=\"\",\"\",ROW()-ROW($A$3))","v":""},{"$f":"IF(سفارشات!H265<>0,سفارشات!C265,\"\")","v":""},{"$f":"IF(سفارشات!H265<>0,سفارشات!B265,\"\")","v":""},{"$f":"IF(سفارشات!H265<>0,سفارشات!D265,\"\")","v":""},{"$f":"IF(سفارشات!H265<>0,سفارشات!E265,\"\")","v":""},{"$f":"IF(سفارشات!H265<>0,سفارشات!F265,\"\")","v":""},{"$f":"IF(C267=\"\",\"\",E267-F267)","v":""}]
[{"$f":"IF(C268=\"\",\"\",ROW()-ROW($A$3))","v":""},{"$f":"IF(سفارشات!H266<>0,سفارشات!C266,\"\")","v":""},{"$f":"IF(سفارشات!H266<>0,سفارشات!B266,\"\")","v":""},{"$f":"IF(سفارشات!H266<>0,سفارشات!D266,\"\")","v":""},{"$f":"IF(سفارشات!H266<>0,سفارشات!E266,\"\")","v":""},{"$f":"IF(سفارشات!H266<>0,سفارشات!F266,\"\")","v":""},{"$f":"IF(C268=\"\",\"\",E268-F268)","v":""}]
[{"$f":"IF(C269=\"\",\"\",ROW()-ROW($A$3))","v":""},{"$f":"IF(سفارشات!H267<>0,سفارشات!C267,\"\")","v":""},{"$f":"IF(سفارشات!H267<>0,سفارشات!B267,\"\")","v":""},{"$f":"IF(سفارشات!H267<>0,سفارشات!D267,\"\")","v":""},{"$f":"IF(سفارشات!H267<>0,سفارشات!E267,\"\")","v":""},{"$f":"IF(سفارشات!H267<>0,سفارشات!F267,\"\")","v":""},{"$f":"IF(C269=\"\",\"\",E269-F269)","v":""}]
[{"$f":"IF(C270=\"\",\"\",ROW()-ROW($A$3))","v":""},{"$f":"IF(سفارشات!H268<>0,سفارشات!C268,\"\")","v":""},{"$f":"IF(سفارشات!H268<>0,سفارشات!B268,\"\")","v":""},{"$f":"IF(سفارشات!H268<>0,سفارشات!D268,\"\")","v":""},{"$f":"IF(سفارشات!H268<>0,سفارشات!E268,\"\")","v":""},{"$f":"IF(سفارشات!H268<>0,سفارشات!F268,\"\")","v":""},{"$f":"IF(C270=\"\",\"\",E270-F270)","v":""}]
[{"$f":"IF(C271=\"\",\"\",ROW()-ROW($A$3))","v":""},{"$f":"IF(سفارشات!H269<>0,سفارشات!C269,\"\")","v":""},{"$f":"IF(سفارشات!H269<>0,سفارشات!B269,\"\")","v":""},{"$f":"IF(سفارشات!H269<>0,سفارشات!D269,\"\")","v":""},{"$f":"IF(سفارشات!H269<>0,سفارشات!E269,\"\")","v":""},{"$f":"IF(سفارشات!H269<>0,سفارشات!F269,\"\")","v":""},{"$f":"IF(C271=\"\",\"\",E271-F271)","v":""}]
[{"$f":"IF(C272=\"\",\"\",ROW()-ROW($A$3))","v":""},{"$f":"IF(سفارشات!H270<>0,سفارشات!C270,\"\")","v":""},{"$f":"IF(سفارشات!H270<>0,سفارشات!B270,\"\")","v":""},{"$f":"IF(سفارشات!H270<>0,سفارشات!D270,\"\")","v":""},{"$f":"IF(سفارشات!H270<>0,سفارشات!E270,\"\")","v":""},{"$f":"IF(سفارشات!H270<>0,سفارشات!F270,\"\")","v":""},{"$f":"IF(C272=\"\",\"\",E272-F272)","v":""}]
[{"$f":"IF(C273=\"\",\"\",ROW()-ROW($A$3))","v":""},{"$f":"IF(سفارشات!H271<>0,سفارشات!C271,\"\")","v":""},{"$f":"IF(سفارشات!H271<>0,سفارشات!B271,\"\")","v":""},{"$f":"IF(سفارشات!H271<>0,سفارشات!D271,\"\")","v":""},{"$f":"IF(سفارشات!H271<>0,سفارشات!E271,\"\")","v":""},{"$f":"IF(سفارشات!H271<>0,سفارشات!F271,\"\")","v":""},{"$f":"IF(C273=\"\",\"\",E273-F273)","v":""}]
[{"$f":"IF(C274=\"\",\"\",ROW()-ROW($A$3))","v":""},{"$f":"IF(سفارشات!H272<>0,سفارشات!C272,\"\")","v":""},{"$f":"IF(سفارشات!H272<>0,سفارشات!B272,\"\")","v":""},{"$f":"IF(سفارشات!H272<>0,سفارشات!D272,\"\")","v":""},{"$f":"IF(سفارشات!H272<>0,سفارشات!E272,\"\")","v":""},{"$f":"IF(سفارشات!H272<>0,سفارشات!F272,\"\")","v":""},{"$f":"IF(C274=\"\",\"\",E274-F274)","v":""}]
[{"$f":"IF(C275=\"\",\"\",ROW()-ROW($A$3))","v":""},{"$f":"IF(سفارشات!H273<>0,سفارشات!C273,\"\")","v":""},{"$f":"IF(سفارشات!H273<>0,سفارشات!B273,\"\")","v":""},{"$f":"IF(سفارشات!H273<>0,سفارشات!D273,\"\")","v":""},{"$f":"IF(سفارشات!H273<>0,سفارشات!E273,\"\")","v":""},{"$f":"IF(سفارشات!H273<>0,سفارشات!F273,\"\")","v":""},{"$f":"IF(C275=\"\",\"\",E275-F275)","v":""}]
[{"$f":"IF(C276=\"\",\"\",ROW()-ROW($A$3))","v":""},{"$f":"IF(سفارشات!H274<>0,سفارشات!C274,\"\")","v":""},{"$f":"IF(سفارشات!H274<>0,سفارشات!B274,\"\")","v":""},{"$f":"IF(سفارشات!H274<>0,سفارشات!D274,\"\")","v":""},{"$f":"IF(سفارشات!H274<>0,سفارشات!E274,\"\")","v":""},{"$f":"IF(سفارشات!H274<>0,سفارشات!F274,\"\")","v":""},{"$f":"IF(C276=\"\",\"\",E276-F276)","v":""}]
[{"$f":"IF(C277=\"\",\"\",ROW()-ROW($A$3))","v":""},{"$f":"IF(سفارشات!H275<>0,سفارشات!C275,\"\")","v":""},{"$f":"IF(سفارشات!H275<>0,سفارشات!B275,\"\")","v":""},{"$f":"IF(سفارشات!H275<>0,سفارشات!D275,\"\")","v":""},{"$f":"IF(سفارشات!H275<>0,سفارشات!E275,\"\")","v":""},{"$f":"IF(سفارشات!H275<>0,سفارشات!F275,\"\")","v":""},{"$f":"IF(C277=\"\",\"\",E277-F277)","v":""}]
[{"$f":"IF(C278=\"\",\"\",ROW()-ROW($A$3))","v":""},{"$f":"IF(سفارشات!H276<>0,سفارشات!C276,\"\")","v":""},{"$f":"IF(سفارشات!H276<>0,سفارشات!B276,\"\")","v":""},{"$f":"IF(سفارشات!H276<>0,سفارشات!D276,\"\")","v":""},{"$f":"IF(سفارشات!H276<>0,سفارشات!E276,\"\")","v":""},{"$f":"IF(سفارشات!H276<>0,سفارشات!F276,\"\")","v":""},{"$f":"IF(C278=\"\",\"\",E278-F278)","v":""}]
[{"$f":"IF(C279=\"\",\"\",ROW()-ROW($A$3))","v":""},{"$f":"IF(سفارشات!H277<>0,سفارشات!C277,\"\")","v":""},{"$f":"IF(سفارشات!H277<>0,سفارشات!B277,\"\")","v":""},{"$f":"IF(سفارشات!H277<>0,سفارشات!D277,\"\")","v":""},{"$f":"IF(سفارشات!H277<>0,سفارشات!E277,\"\")","v":""},{"$f":"IF(سفارشات!H277<>0,سفارشات!F277,\"\")","v":""},{"$f":"IF(C279=\"\",\"\",E279-F279)","v":""}]
[{"$f":"IF(C280=\"\",\"\",ROW()-ROW($A$3))","v":""},{"$f":"IF(سفارشات!H278<>0,سفارشات!C278,\"\")","v":""},{"$f":"IF(سفارشات!H278<>0,سفارشات!B278,\"\")","v":""},{"$f":"IF(سفارشات!H278<>0,سفارشات!D278,\"\")","v":""},{"$f":"IF(سفارشات!H278<>0,سفارشات!E278,\"\")","v":""},{"$f":"IF(سفارشات!H278<>0,سفارشات!F278,\"\")","v":""},{"$f":"IF(C280=\"\",\"\",E280-F280)","v":""}]
[{"$f":"IF(C281=\"\",\"\",ROW()-ROW($A$3))","v":""},{"$f":"IF(سفارشات!H279<>0,سفارشات!C279,\"\")","v":""},{"$f":"IF(سفارشات!H279<>0,سفارشات!B279,\"\")","v":""},{"$f":"IF(سفارشات!H279<>0,سفارشات!D279,\"\")","v":""},{"$f":"IF(سفارشات!H279<>0,سفارشات!E279,\"\")","v":""},{"$f":"IF(سفارشات!H279<>0,سفارشات!F279,\"\")","v":""},{"$f":"IF(C281=\"\",\"\",E281-F281)","v":""}]
[{"$f":"IF(C282=\"\",\"\",ROW()-ROW($A$3))","v":""},{"$f":"IF(سفارشات!H280<>0,سفارشات!C280,\"\")","v":""},{"$f":"IF(سفارشات!H280<>0,سفارشات!B280,\"\")","v":""},{"$f":"IF(سفارشات!H280<>0,سفارشات!D280,\"\")","v":""},{"$f":"IF(سفارشات!H280<>0,سفارشات!E280,\"\")","v":""},{"$f":"IF(سفارشات!H280<>0,سفارشات!F280,\"\")","v":""},{"$f":"IF(C282=\"\",\"\",E282-F282)","v":""}]
[{"$f":"IF(C283=\"\",\"\",ROW()-ROW($A$3))","v":""},{"$f":"IF(سفارشات!H281<>0,سفارشات!C281,\"\")","v":""},{"$f":"IF(سفارشات!H281<>0,سفارشات!B281,\"\")","v":""},{"$f":"IF(سفارشات!H281<>0,سفارشات!D281,\"\")","v":""},{"$f":"IF(سفارشات!H281<>0,سفارشات!E281,\"\")","v":""},{"$f":"IF(سفارشات!H281<>0,سفارشات!F281,\"\")","v":""},{"$f":"IF(C283=\"\",\"\",E283-F283)","v":""}]
[{"$f":"IF(C284=\"\",\"\",ROW()-ROW($A$3))","v":""},{"$f":"IF(سفارشات!H282<>0,سفارشات!C282,\"\")","v":""},{"$f":"IF(سفارشات!H282<>0,سفارشات!B282,\"\")","v":""},{"$f":"IF(سفارشات!H282<>0,سفارشات!D282,\"\")","v":""},{"$f":"IF(سفارشات!H282<>0,سفارشات!E282,\"\")","v":""},{"$f":"IF(سفارشات!H282<>0,سفارشات!F282,\"\")","v":""},{"$f":"IF(C284=\"\",\"\",E284-F284)","v":""}]
[{"$f":"IF(C285=\"\",\"\",ROW()-ROW($A$3))","v":""},{"$f":"IF(سفارشات!H283<>0,سفارشات!C283,\"\")","v":""},{"$f":"IF(سفارشات!H283<>0,سفارشات!B283,\"\")","v":""},{"$f":"IF(سفارشات!H283<>0,سفارشات!D283,\"\")","v":""},{"$f":"IF(سفارشات!H283<>0,سفارشات!E283,\"\")","v":""},{"$f":"IF(سفارشات!H283<>0,سفارشات!F283,\"\")","v":""},{"$f":"IF(C285=\"\",\"\",E285-F285)","v":""}]
[{"$f":"IF(C286=\"\",\"\",ROW()-ROW($A$3))","v":""},{"$f":"IF(سفارشات!H284<>0,سفارشات!C284,\"\")","v":""},{"$f":"IF(سفارشات!H284<>0,سفارشات!B284,\"\")","v":""},{"$f":"IF(سفارشات!H284<>0,سفارشات!D284,\"\")","v":""},{"$f":"IF(سفارشات!H284<>0,سفارشات!E284,\"\")","v":""},{"$f":"IF(سفارشات!H284<>0,سفارشات!F284,\"\")","v":""},{"$f":"IF(C286=\"\",\"\",E286-F286)","v":""}]
[{"$f":"IF(C287=\"\",\"\",ROW()-ROW($A$3))","v":""},{"$f":"IF(سفارشات!H285<>0,سفارشات!C285,\"\")","v":""},{"$f":"IF(سفارشات!H285<>0,سفارشات!B285,\"\")","v":""},{"$f":"IF(سفارشات!H285<>0,سفارشات!D285,\"\")","v":""},{"$f":"IF(سفارشات!H285<>0,سفارشات!E285,\"\")","v":""},{"$f":"IF(سفارشات!H285<>0,سفارشات!F285,\"\")","v":""},{"$f":"IF(C287=\"\",\"\",E287-F287)","v":""}]
[{"$f":"IF(C288=\"\",\"\",ROW()-ROW($A$3))","v":""},{"$f":"IF(سفارشات!H286<>0,سفارشات!C286,\"\")","v":""},{"$f":"IF(سفارشات!H286<>0,سفارشات!B286,\"\")","v":""},{"$f":"IF(سفارشات!H286<>0,سفارشات!D286,\"\")","v":""},{"$f":"IF(سفارشات!H286<>0,سفارشات!E286,\"\")","v":""},{"$f":"IF(سفارشات!H286<>0,سفارشات!F286,\"\")","v":""},{"$f":"IF(C288=\"\",\"\",E288-F288)","v":""}]
[{"$f":"IF(C289=\"\",\"\",ROW()-ROW($A$3))","v":""},{"$f":"IF(سفارشات!H287<>0,سفارشات!C287,\"\")","v":""},{"$f":"IF(سفارشات!H287<>0,سفارشات!B287,\"\")","v":""},{"$f":"IF(سفارشات!H287<>0,سفارشات!D287,\"\")","v":""},{"$f":"IF(سفارشات!H287<>0,سفارشات!E287,\"\")","v":""},{"$f":"IF(سفارشات!H287<>0,سفارشات!F287,\"\")","v":""},{"$f":"IF(C289=\"\",\"\",E289-F289)","v":""}]
[{"$f":"IF(C290=\"\",\"\",ROW()-ROW($A$3))","v":""},{"$f":"IF(سفارشات!H288<>0,سفارشات!C288,\"\")","v":""},{"$f":"IF(سفارشات!H288<>0,سفارشات!B288,\"\")","v":""},{"$f":"IF(سفارشات!H288<>0,سفارشات!D288,\"\")","v":""},{"$f":"IF(سفارشات!H288<>0,سفارشات!E288,\"\")","v":""},{"$f":"IF(سفارشات!H288<>0,سفارشات!F288,\"\")","v":""},{"$f":"IF(C290=\"\",\"\",E290-F290)","v":""}]
[{"$f":"IF(C291=\"\",\"\",ROW()-ROW($A$3))","v":""},{"$f":"IF(سفارشات!H289<>0,سفارشات!C289,\"\")","v":""},{"$f":"IF(سفارشات!H289<>0,سفارشات!B289,\"\")","v":""},{"$f":"IF(سفارشات!H289<>0,سفارشات!D289,\"\")","v":""},{"$f":"IF(سفارشات!H289<>0,سفارشات!E289,\"\")","v":""},{"$f":"IF(سفارشات!H289<>0,سفارشات!F289,\"\")","v":""},{"$f":"IF(C291=\"\",\"\",E291-F291)","v":""}]
[{"$f":"IF(C292=\"\",\"\",ROW()-ROW($A$3))","v":""},{"$f":"IF(سفارشات!H290<>0,سفارشات!C290,\"\")","v":""},{"$f":"IF(سفارشات!H290<>0,سفارشات!B290,\"\")","v":""},{"$f":"IF(سفارشات!H290<>0,سفارشات!D290,\"\")","v":""},{"$f":"IF(سفارشات!H290<>0,سفارشات!E290,\"\")","v":""},{"$f":"IF(سفارشات!H290<>0,سفارشات!F290,\"\")","v":""},{"$f":"IF(C292=\"\",\"\",E292-F292)","v":""}]
[{"$f":"IF(C293=\"\",\"\",ROW()-ROW($A$3))","v":""},{"$f":"IF(سفارشات!H291<>0,سفارشات!C291,\"\")","v":""},{"$f":"IF(سفارشات!H291<>0,سفارشات!B291,\"\")","v":""},{"$f":"IF(سفارشات!H291<>0,سفارشات!D291,\"\")","v":""},{"$f":"IF(سفارشات!H291<>0,سفارشات!E291,\"\")","v":""},{"$f":"IF(سفارشات!H291<>0,سفارشات!F291,\"\")","v":""},{"$f":"IF(C293=\"\",\"\",E293-F293)","v":""}]
[{"$f":"IF(C294=\"\",\"\",ROW()-ROW($A$3))","v":""},{"$f":"IF(سفارشات!H292<>0,سفارشات!C292,\"\")","v":""},{"$f":"IF(سفارشات!H292<>0,سفارشات!B292,\"\")","v":""},{"$f":"IF(سفارشات!H292<>0,سفارشات!D292,\"\")","v":""},{"$f":"IF(سفارشات!H292<>0,سفارشات!E292,\"\")","v":""},{"$f":"IF(سفارشات!H292<>0,سفارشات!F292,\"\")","v":""},{"$f":"IF(C294=\"\",\"\",E294-F294)","v":""}]
[{"$f":"IF(C295=\"\",\"\",ROW()-ROW($A$3))","v":""},{"$f":"IF(سفارشات!H293<>0,سفارشات!C293,\"\")","v":""},{"$f":"IF(سفارشات!H293<>0,سفارشات!B293,\"\")","v":""},{"$f":"IF(سفارشات!H293<>0,سفارشات!D293,\"\")","v":""},{"$f":"IF(سفارشات!H293<>0,سفارشات!E293,\"\")","v":""},{"$f":"IF(سفارشات!H293<>0,سفارشات!F293,\"\")","v":""},{"$f":"IF(C295=\"\",\"\",E295-F295)","v":""}]
[{"$f":"IF(C296=\"\",\"\",ROW()-ROW($A$3))","v":""},{"$f":"IF(سفارشات!H294<>0,سفارشات!C294,\"\")","v":""},{"$f":"IF(سفارشات!H294<>0,سفارشات!B294,\"\")","v":""},{"$f":"IF(سفارشات!H294<>0,سفارشات!D294,\"\")","v":""},{"$f":"IF(سفارشات!H294<>0,سفارشات!E294,\"\")","v":""},{"$f":"IF(سفارشات!H294<>0,سفارشات!F294,\"\")","v":""},{"$f":"IF(C296=\"\",\"\",E296-F296)","v":""}]
[{"$f":"IF(C297=\"\",\"\",ROW()-ROW($A$3))","v":""},{"$f":"IF(سفارشات!H295<>0,سفارشات!C295,\"\")","v":""},{"$f":"IF(سفارشات!H295<>0,سفارشات!B295,\"\")","v":""},{"$f":"IF(سفارشات!H295<>0,سفارشات!D295,\"\")","v":""},{"$f":"IF(سفارشات!H295<>0,سفارشات!E295,\"\")","v":""},{"$f":"IF(سفارشات!H295<>0,سفارشات!F295,\"\")","v":""},{"$f":"IF(C297=\"\",\"\",E297-F297)","v":""}]
[{"$f":"IF(C298=\"\",\"\",ROW()-ROW($A$3))","v":""},{"$f":"IF(سفارشات!H296<>0,سفارشات!C296,\"\")","v":""},{"$f":"IF(سفارشات!H296<>0,سفارشات!B296,\"\")","v":""},{"$f":"IF(سفارشات!H296<>0,سفارشات!D296,\"\")","v":""},{"$f":"IF(سفارشات!H296<>0,سفارشات!E296,\"\")","v":""},{"$f":"IF(سفارشات!H296<>0,سفارشات!F296,\"\")","v":""},{"$f":"IF(C298=\"\",\"\",E298-F298)","v":""}]
[{"$f":"IF(C299=\"\",\"\",ROW()-ROW($A$3))","v":""},{"$f":"IF(سفارشات!H297<>0,سفارشات!C297,\"\")","v":""},{"$f":"IF(سفارشات!H297<>0,سفارشات!B297,\"\")","v":""},{"$f":"IF(سفارشات!H297<>0,سفارشات!D297,\"\")","v":""},{"$f":"IF(سفارشات!H297<>0,سفارشات!E297,\"\")","v":""},{"$f":"IF(سفارشات!H297<>0,سفارشات!F297,\"\")","v":""},{"$f":"IF(C299=\"\",\"\",E299-F299)","v":""}]
[{"$f":"IF(C300=\"\",\"\",ROW()-ROW($A$3))","v":""},{"$f":"IF(سفارشات!H298<>0,سفارشات!C298,\"\")","v":""},{"$f":"IF(سفارشات!H298<>0,سفارشات!B298,\"\")","v":""},{"$f":"IF(سفارشات!H298<>0,سفارشات!D298,\"\")","v":""},{"$f":"IF(سفارشات!H298<>0,سفارشات!E298,\"\")","v":""},{"$f":"IF(سفارشات!H298<>0,سفارشات!F298,\"\")","v":""},{"$f":"IF(C300=\"\",\"\",E300-F300)","v":""}]
[{"$f":"IF(C301=\"\",\"\",ROW()-ROW($A$3))","v":""},{"$f":"IF(سفارشات!H299<>0,سفارشات!C299,\"\")","v":""},{"$f":"IF(سفارشات!H299<>0,سفارشات!B299,\"\")","v":""},{"$f":"IF(سفارشات!H299<>0,سفارشات!D299,\"\")","v":""},{"$f":"IF(سفارشات!H299<>0,سفارشات!E299,\"\")","v":""},{"$f":"IF(سفارشات!H299<>0,سفارشات!F299,\"\")","v":""},{"$f":"IF(C301=\"\",\"\",E301-F301)","v":""}]
[{"$f":"IF(C302=\"\",\"\",ROW()-ROW($A$3))","v":""},{"$f":"IF(سفارشات!H300<>0,سفارشات!C300,\"\")","v":""},{"$f":"IF(سفارشات!H300<>0,سفارشات!B300,\"\")","v":""},{"$f":"IF(سفارشات!H300<>0,سفارشات!D300,\"\")","v":""},{"$f":"IF(سفارشات!H300<>0,سفارشات!E300,\"\")","v":""},{"$f":"IF(سفارشات!H300<>0,سفارشات!F300,\"\")","v":""},{"$f":"IF(C302=\"\",\"\",E302-F302)","v":""}]
[{"$f":"IF(C303=\"\",\"\",ROW()-ROW($A$3))","v":""},{"$f":"IF(سفارشات!H301<>0,سفارشات!C301,\"\")","v":""},{"$f":"IF(سفارشات!H301<>0,سفارشات!B301,\"\")","v":""},{"$f":"IF(سفارشات!H301<>0,سفارشات!D301,\"\")","v":""},{"$f":"IF(سفارشات!H301<>0,سفارشات!E301,\"\")","v":""},{"$f":"IF(سفارشات!H301<>0,سفارشات!F301,\"\")","v":""},{"$f":"IF(C303=\"\",\"\",E303-F303)","v":""}]
[{"$f":"IF(C304=\"\",\"\",ROW()-ROW($A$3))","v":""},{"$f":"IF(سفارشات!H302<>0,سفارشات!C302,\"\")","v":""},{"$f":"IF(سفارشات!H302<>0,سفارشات!B302,\"\")","v":""},{"$f":"IF(سفارشات!H302<>0,سفارشات!D302,\"\")","v":""},{"$f":"IF(سفارشات!H302<>0,سفارشات!E302,\"\")","v":""},{"$f":"IF(سفارشات!H302<>0,سفارشات!F302,\"\")","v":""},{"$f":"IF(C304=\"\",\"\",E304-F304)","v":""}]
[{"$f":"IF(C305=\"\",\"\",ROW()-ROW($A$3))","v":""},{"$f":"IF(سفارشات!H303<>0,سفارشات!C303,\"\")","v":""},{"$f":"IF(سفارشات!H303<>0,سفارشات!B303,\"\")","v":""},{"$f":"IF(سفارشات!H303<>0,سفارشات!D303,\"\")","v":""},{"$f":"IF(سفارشات!H303<>0,سفارشات!E303,\"\")","v":""},{"$f":"IF(سفارشات!H303<>0,سفارشات!F303,\"\")","v":""},{"$f":"IF(C305=\"\",\"\",E305-F305)","v":""}]
[{"$f":"IF(C306=\"\",\"\",ROW()-ROW($A$3))","v":""},{"$f":"IF(سفارشات!H304<>0,سفارشات!C304,\"\")","v":""},{"$f":"IF(سفارشات!H304<>0,سفارشات!B304,\"\")","v":""},{"$f":"IF(سفارشات!H304<>0,سفارشات!D304,\"\")","v":""},{"$f":"IF(سفارشات!H304<>0,سفارشات!E304,\"\")","v":""},{"$f":"IF(سفارشات!H304<>0,سفارشات!F304,\"\")","v":""},{"$f":"IF(C306=\"\",\"\",E306-F306)","v":""}]
[{"$f":"IF(C307=\"\",\"\",ROW()-ROW($A$3))","v":""},{"$f":"IF(سفارشات!H305<>0,سفارشات!C305,\"\")","v":""},{"$f":"IF(سفارشات!H305<>0,سفارشات!B305,\"\")","v":""},{"$f":"IF(سفارشات!H305<>0,سفارشات!D305,\"\")","v":""},{"$f":"IF(سفارشات!H305<>0,سفارشات!E305,\"\")","v":""},{"$f":"IF(سفارشات!H305<>0,سفارشات!F305,\"\")","v":""},{"$f":"IF(C307=\"\",\"\",E307-F307)","v":""}]
[{"$f":"IF(C308=\"\",\"\",ROW()-ROW($A$3))","v":""},{"$f":"IF(سفارشات!H306<>0,سفارشات!C306,\"\")","v":""},{"$f":"IF(سفارشات!H306<>0,سفارشات!B306,\"\")","v":""},{"$f":"IF(سفارشات!H306<>0,سفارشات!D306,\"\")","v":""},{"$f":"IF(سفارشات!H306<>0,سفارشات!E306,\"\")","v":""},{"$f":"IF(سفارشات!H306<>0,سفارشات!F306,\"\")","v":""},{"$f":"IF(C308=\"\",\"\",E308-F308)","v":""}]
[{"$f":"IF(C309=\"\",\"\",ROW()-ROW($A$3))","v":""},{"$f":"IF(سفارشات!H307<>0,سفارشات!C307,\"\")","v":""},{"$f":"IF(سفارشات!H307<>0,سفارشات!B307,\"\")","v":""},{"$f":"IF(سفارشات!H307<>0,سفارشات!D307,\"\")","v":""},{"$f":"IF(سفارشات!H307<>0,سفارشات!E307,\"\")","v":""},{"$f":"IF(سفارشات!H307<>0,سفارشات!F307,\"\")","v":""},{"$f":"IF(C309=\"\",\"\",E309-F309)","v":""}]
[{"$f":"IF(C310=\"\",\"\",ROW()-ROW($A$3))","v":""},{"$f":"IF(سفارشات!H308<>0,سفارشات!C308,\"\")","v":""},{"$f":"IF(سفارشات!H308<>0,سفارشات!B308,\"\")","v":""},{"$f":"IF(سفارشات!H308<>0,سفارشات!D308,\"\")","v":""},{"$f":"IF(سفارشات!H308<>0,سفارشات!E308,\"\")","v":""},{"$f":"IF(سفارشات!H308<>0,سفارشات!F308,\"\")","v":""},{"$f":"IF(C310=\"\",\"\",E310-F310)","v":""}]
[{"$f":"IF(C311=\"\",\"\",ROW()-ROW($A$3))","v":""},{"$f":"IF(سفارشات!H309<>0,سفارشات!C309,\"\")","v":""},{"$f":"IF(سفارشات!H309<>0,سفارشات!B309,\"\")","v":""},{"$f":"IF(سفارشات!H309<>0,سفارشات!D309,\"\")","v":""},{"$f":"IF(سفارشات!H309<>0,سفارشات!E309,\"\")","v":""},{"$f":"IF(سفارشات!H309<>0,سفارشات!F309,\"\")","v":""},{"$f":"IF(C311=\"\",\"\",E311-F311)","v":""}]
[{"$f":"IF(C312=\"\",\"\",ROW()-ROW($A$3))","v":""},{"$f":"IF(سفارشات!H310<>0,سفارشات!C310,\"\")","v":""},{"$f":"IF(سفارشات!H310<>0,سفارشات!B310,\"\")","v":""},{"$f":"IF(سفارشات!H310<>0,سفارشات!D310,\"\")","v":""},{"$f":"IF(سفارشات!H310<>0,سفارشات!E310,\"\")","v":""},{"$f":"IF(سفارشات!H310<>0,سفارشات!F310,\"\")","v":""},{"$f":"IF(C312=\"\",\"\",E312-F312)","v":""}]
[{"$f":"IF(C313=\"\",\"\",ROW()-ROW($A$3))","v":""},{"$f":"IF(سفارشات!H311<>0,سفارشات!C311,\"\")","v":""},{"$f":"IF(سفارشات!H311<>0,سفارشات!B311,\"\")","v":""},{"$f":"IF(سفارشات!H311<>0,سفارشات!D311,\"\")","v":""},{"$f":"IF(سفارشات!H311<>0,سفارشات!E311,\"\")","v":""},{"$f":"IF(سفارشات!H311<>0,سفارشات!F311,\"\")","v":""},{"$f":"IF(C313=\"\",\"\",E313-F313)","v":""}]
[{"$f":"IF(C314=\"\",\"\",ROW()-ROW($A$3))","v":""},{"$f":"IF(سفارشات!H312<>0,سفارشات!C312,\"\")","v":""},{"$f":"IF(سفارشات!H312<>0,سفارشات!B312,\"\")","v":""},{"$f":"IF(سفارشات!H312<>0,سفارشات!D312,\"\")","v":""},{"$f":"IF(سفارشات!H312<>0,سفارشات!E312,\"\")","v":""},{"$f":"IF(سفارشات!H312<>0,سفارشات!F312,\"\")","v":""},{"$f":"IF(C314=\"\",\"\",E314-F314)","v":""}]
[{"$f":"IF(C315=\"\",\"\",ROW()-ROW($A$3))","v":""},{"$f":"IF(سفارشات!H313<>0,سفارشات!C313,\"\")","v":""},{"$f":"IF(سفارشات!H313<>0,سفارشات!B313,\"\")","v":""},{"$f":"IF(سفارشات!H313<>0,سفارشات!D313,\"\")","v":""},{"$f":"IF(سفارشات!H313<>0,سفارشات!E313,\"\")","v":""},{"$f":"IF(سفارشات!H313<>0,سفارشات!F313,\"\")","v":""},{"$f":"IF(C315=\"\",\"\",E315-F315)","v":""}]
[{"$f":"IF(C316=\"\",\"\",ROW()-ROW($A$3))","v":""},{"$f":"IF(سفارشات!H314<>0,سفارشات!C314,\"\")","v":""},{"$f":"IF(سفارشات!H314<>0,سفارشات!B314,\"\")","v":""},{"$f":"IF(سفارشات!H314<>0,سفارشات!D314,\"\")","v":""},{"$f":"IF(سفارشات!H314<>0,سفارشات!E314,\"\")","v":""},{"$f":"IF(سفارشات!H314<>0,سفارشات!F314,\"\")","v":""},{"$f":"IF(C316=\"\",\"\",E316-F316)","v":""}]
[{"$f":"IF(C317=\"\",\"\",ROW()-ROW($A$3))","v":""},{"$f":"IF(سفارشات!H315<>0,سفارشات!C315,\"\")","v":""},{"$f":"IF(سفارشات!H315<>0,سفارشات!B315,\"\")","v":""},{"$f":"IF(سفارشات!H315<>0,سفارشات!D315,\"\")","v":""},{"$f":"IF(سفارشات!H315<>0,سفارشات!E315,\"\")","v":""},{"$f":"IF(سفارشات!H315<>0,سفارشات!F315,\"\")","v":""},{"$f":"IF(C317=\"\",\"\",E317-F317)","v":""}]
[{"$f":"IF(C318=\"\",\"\",ROW()-ROW($A$3))","v":""},{"$f":"IF(سفارشات!H316<>0,سفارشات!C316,\"\")","v":""},{"$f":"IF(سفارشات!H316<>0,سفارشات!B316,\"\")","v":""},{"$f":"IF(سفارشات!H316<>0,سفارشات!D316,\"\")","v":""},{"$f":"IF(سفارشات!H316<>0,سفارشات!E316,\"\")","v":""},{"$f":"IF(سفارشات!H316<>0,سفارشات!F316,\"\")","v":""},{"$f":"IF(C318=\"\",\"\",E318-F318)","v":""}]
[{"$f":"IF(C319=\"\",\"\",ROW()-ROW($A$3))","v":""},{"$f":"IF(سفارشات!H317<>0,سفارشات!C317,\"\")","v":""},{"$f":"IF(سفارشات!H317<>0,سفارشات!B317,\"\")","v":""},{"$f":"IF(سفارشات!H317<>0,سفارشات!D317,\"\")","v":""},{"$f":"IF(سفارشات!H317<>0,سفارشات!E317,\"\")","v":""},{"$f":"IF(سفارشات!H317<>0,سفارشات!F317,\"\")","v":""},{"$f":"IF(C319=\"\",\"\",E319-F319)","v":""}]
[{"$f":"IF(C320=\"\",\"\",ROW()-ROW($A$3))","v":""},{"$f":"IF(سفارشات!H318<>0,سفارشات!C318,\"\")","v":""},{"$f":"IF(سفارشات!H318<>0,سفارشات!B318,\"\")","v":""},{"$f":"IF(سفارشات!H318<>0,سفارشات!D318,\"\")","v":""},{"$f":"IF(سفارشات!H318<>0,سفارشات!E318,\"\")","v":""},{"$f":"IF(سفارشات!H318<>0,سفارشات!F318,\"\")","v":""},{"$f":"IF(C320=\"\",\"\",E320-F320)","v":""}]
[{"$f":"IF(C321=\"\",\"\",ROW()-ROW($A$3))","v":""},{"$f":"IF(سفارشات!H319<>0,سفارشات!C319,\"\")","v":""},{"$f":"IF(سفارشات!H319<>0,سفارشات!B319,\"\")","v":""},{"$f":"IF(سفارشات!H319<>0,سفارشات!D319,\"\")","v":""},{"$f":"IF(سفارشات!H319<>0,سفارشات!E319,\"\")","v":""},{"$f":"IF(سفارشات!H319<>0,سفارشات!F319,\"\")","v":""},{"$f":"IF(C321=\"\",\"\",E321-F321)","v":""}]
[{"$f":"IF(C322=\"\",\"\",ROW()-ROW($A$3))","v":""},{"$f":"IF(سفارشات!H320<>0,سفارشات!C320,\"\")","v":""},{"$f":"IF(سفارشات!H320<>0,سفارشات!B320,\"\")","v":""},{"$f":"IF(سفارشات!H320<>0,سفارشات!D320,\"\")","v":""},{"$f":"IF(سفارشات!H320<>0,سفارشات!E320,\"\")","v":""},{"$f":"IF(سفارشات!H320<>0,سفارشات!F320,\"\")","v":""},{"$f":"IF(C322=\"\",\"\",E322-F322)","v":""}]
[{"$f":"IF(C323=\"\",\"\",ROW()-ROW($A$3))","v":""},{"$f":"IF(سفارشات!H321<>0,سفارشات!C321,\"\")","v":""},{"$f":"IF(سفارشات!H321<>0,سفارشات!B321,\"\")","v":""},{"$f":"IF(سفارشات!H321<>0,سفارشات!D321,\"\")","v":""},{"$f":"IF(سفارشات!H321<>0,سفارشات!E321,\"\")","v":""},{"$f":"IF(سفارشات!H321<>0,سفارشات!F321,\"\")","v":""},{"$f":"IF(C323=\"\",\"\",E323-F323)","v":""}]
[{"$f":"IF(C324=\"\",\"\",ROW()-ROW($A$3))","v":""},{"$f":"IF(سفارشات!H322<>0,سفارشات!C322,\"\")","v":""},{"$f":"IF(سفارشات!H322<>0,سفارشات!B322,\"\")","v":""},{"$f":"IF(سفارشات!H322<>0,سفارشات!D322,\"\")","v":""},{"$f":"IF(سفارشات!H322<>0,سفارشات!E322,\"\")","v":""},{"$f":"IF(سفارشات!H322<>0,سفارشات!F322,\"\")","v":""},{"$f":"IF(C324=\"\",\"\",E324-F324)","v":""}]
[{"$f":"IF(C325=\"\",\"\",ROW()-ROW($A$3))","v":""},{"$f":"IF(سفارشات!H323<>0,سفارشات!C323,\"\")","v":""},{"$f":"IF(سفارشات!H323<>0,سفارشات!B323,\"\")","v":""},{"$f":"IF(سفارشات!H323<>0,سفارشات!D323,\"\")","v":""},{"$f":"IF(سفارشات!H323<>0,سفارشات!E323,\"\")","v":""},{"$f":"IF(سفارشات!H323<>0,سفارشات!F323,\"\")","v":""},{"$f":"IF(C325=\"\",\"\",E325-F325)","v":""}]
[{"$f":"IF(C326=\"\",\"\",ROW()-ROW($A$3))","v":""},{"$f":"IF(سفارشات!H324<>0,سفارشات!C324,\"\")","v":""},{"$f":"IF(سفارشات!H324<>0,سفارشات!B324,\"\")","v":""},{"$f":"IF(سفارشات!H324<>0,سفارشات!D324,\"\")","v":""},{"$f":"IF(سفارشات!H324<>0,سفارشات!E324,\"\")","v":""},{"$f":"IF(سفارشات!H324<>0,سفارشات!F324,\"\")","v":""},{"$f":"IF(C326=\"\",\"\",E326-F326)","v":""}]
[{"$f":"IF(C327=\"\",\"\",ROW()-ROW($A$3))","v":""},{"$f":"IF(سفارشات!H325<>0,سفارشات!C325,\"\")","v":""},{"$f":"IF(سفارشات!H325<>0,سفارشات!B325,\"\")","v":""},{"$f":"IF(سفارشات!H325<>0,سفارشات!D325,\"\")","v":""},{"$f":"IF(سفارشات!H325<>0,سفارشات!E325,\"\")","v":""},{"$f":"IF(سفارشات!H325<>0,سفارشات!F325,\"\")","v":""},{"$f":"IF(C327=\"\",\"\",E327-F327)","v":""}]
[{"$f":"IF(C328=\"\",\"\",ROW()-ROW($A$3))","v":""},{"$f":"IF(سفارشات!H326<>0,سفارشات!C326,\"\")","v":""},{"$f":"IF(سفارشات!H326<>0,سفارشات!B326,\"\")","v":""},{"$f":"IF(سفارشات!H326<>0,سفارشات!D326,\"\")","v":""},{"$f":"IF(سفارشات!H326<>0,سفارشات!E326,\"\")","v":""},{"$f":"IF(سفارشات!H326<>0,سفارشات!F326,\"\")","v":""},{"$f":"IF(C328=\"\",\"\",E328-F328)","v":""}]
[{"$f":"IF(C329=\"\",\"\",ROW()-ROW($A$3))","v":""},{"$f":"IF(سفارشات!H327<>0,سفارشات!C327,\"\")","v":""},{"$f":"IF(سفارشات!H327<>0,سفارشات!B327,\"\")","v":""},{"$f":"IF(سفارشات!H327<>0,سفارشات!D327,\"\")","v":""},{"$f":"IF(سفارشات!H327<>0,سفارشات!E327,\"\")","v":""},{"$f":"IF(سفارشات!H327<>0,سفارشات!F327,\"\")","v":""},{"$f":"IF(C329=\"\",\"\",E329-F329)","v":""}]
[{"$f":"IF(C330=\"\",\"\",ROW()-ROW($A$3))","v":""},{"$f":"IF(سفارشات!H328<>0,سفارشات!C328,\"\")","v":""},{"$f":"IF(سفارشات!H328<>0,سفارشات!B328,\"\")","v":""},{"$f":"IF(سفارشات!H328<>0,سفارشات!D328,\"\")","v":""},{"$f":"IF(سفارشات!H328<>0,سفارشات!E328,\"\")","v":""},{"$f":"IF(سفارشات!H328<>0,سفارشات!F328,\"\")","v":""},{"$f":"IF(C330=\"\",\"\",E330-F330)","v":""}]
[{"$f":"IF(C331=\"\",\"\",ROW()-ROW($A$3))","v":""},{"$f":"IF(سفارشات!H329<>0,سفارشات!C329,\"\")","v":""},{"$f":"IF(سفارشات!H329<>0,سفارشات!B329,\"\")","v":""},{"$f":"IF(سفارشات!H329<>0,سفارشات!D329,\"\")","v":""},{"$f":"IF(سفارشات!H329<>0,سفارشات!E329,\"\")","v":""},{"$f":"IF(سفارشات!H329<>0,سفارشات!F329,\"\")","v":""},{"$f":"IF(C331=\"\",\"\",E331-F331)","v":""}]
[{"$f":"IF(C332=\"\",\"\",ROW()-ROW($A$3))","v":""},{"$f":"IF(سفارشات!H330<>0,سفارشات!C330,\"\")","v":""},{"$f":"IF(سفارشات!H330<>0,سفارشات!B330,\"\")","v":""},{"$f":"IF(سفارشات!H330<>0,سفارشات!D330,\"\")","v":""},{"$f":"IF(سفارشات!H330<>0,سفارشات!E330,\"\")","v":""},{"$f":"IF(سفارشات!H330<>0,سفارشات!F330,\"\")","v":""},{"$f":"IF(C332=\"\",\"\",E332-F332)","v":""}]
[{"$f":"IF(C333=\"\",\"\",ROW()-ROW($A$3))","v":""},{"$f":"IF(سفارشات!H331<>0,سفارشات!C331,\"\")","v":""},{"$f":"IF(سفارشات!H331<>0,سفارشات!B331,\"\")","v":""},{"$f":"IF(سفارشات!H331<>0,سفارشات!D331,\"\")","v":""},{"$f":"IF(سفارشات!H331<>0,سفارشات!E331,\"\")","v":""},{"$f":"IF(سفارشات!H331<>0,سفارشات!F331,\"\")","v":""},{"$f":"IF(C333=\"\",\"\",E333-F333)","v":""}]
[{"$f":"IF(C334=\"\",\"\",ROW()-ROW($A$3))","v":""},{"$f":"IF(سفارشات!H332<>0,سفارشات!C332,\"\")","v":""},{"$f":"IF(سفارشات!H332<>0,سفارشات!B332,\"\")","v":""},{"$f":"IF(سفارشات!H332<>0,سفارشات!D332,\"\")","v":""},{"$f":"IF(سفارشات!H332<>0,سفارشات!E332,\"\")","v":""},{"$f":"IF(سفارشات!H332<>0,سفارشات!F332,\"\")","v":""},{"$f":"IF(C334=\"\",\"\",E334-F334)","v":""}]
[{"$f":"IF(C335=\"\",\"\",ROW()-ROW($A$3))","v":""},{"$f":"IF(سفارشات!H333<>0,سفارشات!C333,\"\")","v":""},{"$f":"IF(سفارشات!H333<>0,سفارشات!B333,\"\")","v":""},{"$f":"IF(سفارشات!H333<>0,سفارشات!D333,\"\")","v":""},{"$f":"IF(سفارشات!H333<>0,سفارشات!E333,\"\")","v":""},{"$f":"IF(سفارشات!H333<>0,سفارشات!F333,\"\")","v":""},{"$f":"IF(C335=\"\",\"\",E335-F335)","v":""}]
[{"$f":"IF(C336=\"\",\"\",ROW()-ROW($A$3))","v":""},{"$f":"IF(سفارشات!H334<>0,سفارشات!C334,\"\")","v":""},{"$f":"IF(سفارشات!H334<>0,سفارشات!B334,\"\")","v":""},{"$f":"IF(سفارشات!H334<>0,سفارشات!D334,\"\")","v":""},{"$f":"IF(سفارشات!H334<>0,سفارشات!E334,\"\")","v":""},{"$f":"IF(سفارشات!H334<>0,سفارشات!F334,\"\")","v":""},{"$f":"IF(C336=\"\",\"\",E336-F336)","v":""}]
[{"$f":"IF(C337=\"\",\"\",ROW()-ROW($A$3))","v":""},{"$f":"IF(سفارشات!H335<>0,سفارشات!C335,\"\")","v":""},{"$f":"IF(سفارشات!H335<>0,سفارشات!B335,\"\")","v":""},{"$f":"IF(سفارشات!H335<>0,سفارشات!D335,\"\")","v":""},{"$f":"IF(سفارشات!H335<>0,سفارشات!E335,\"\")","v":""},{"$f":"IF(سفارشات!H335<>0,سفارشات!F335,\"\")","v":""},{"$f":"IF(C337=\"\",\"\",E337-F337)","v":""}]
[{"$f":"IF(C338=\"\",\"\",ROW()-ROW($A$3))","v":""},{"$f":"IF(سفارشات!H336<>0,سفارشات!C336,\"\")","v":""},{"$f":"IF(سفارشات!H336<>0,سفارشات!B336,\"\")","v":""},{"$f":"IF(سفارشات!H336<>0,سفارشات!D336,\"\")","v":""},{"$f":"IF(سفارشات!H336<>0,سفارشات!E336,\"\")","v":""},{"$f":"IF(سفارشات!H336<>0,سفارشات!F336,\"\")","v":""},{"$f":"IF(C338=\"\",\"\",E338-F338)","v":""}]
[{"$f":"IF(C339=\"\",\"\",ROW()-ROW($A$3))","v":""},{"$f":"IF(سفارشات!H337<>0,سفارشات!C337,\"\")","v":""},{"$f":"IF(سفارشات!H337<>0,سفارشات!B337,\"\")","v":""},{"$f":"IF(سفارشات!H337<>0,سفارشات!D337,\"\")","v":""},{"$f":"IF(سفارشات!H337<>0,سفارشات!E337,\"\")","v":""},{"$f":"IF(سفارشات!H337<>0,سفارشات!F337,\"\")","v":""},{"$f":"IF(C339=\"\",\"\",E339-F339)","v":""}]
[{"$f":"IF(C340=\"\",\"\",ROW()-ROW($A$3))","v":""},{"$f":"IF(سفارشات!H338<>0,سفارشات!C338,\"\")","v":""},{"$f":"IF(سفارشات!H338<>0,سفارشات!B338,\"\")","v":""},{"$f":"IF(سفارشات!H338<>0,سفارشات!D338,\"\")","v":""},{"$f":"IF(سفارشات!H338<>0,سفارشات!E338,\"\")","v":""},{"$f":"IF(سفارشات!H338<>0,سفارشات!F338,\"\")","v":""},{"$f":"IF(C340=\"\",\"\",E340-F340)","v":""}]
[{"$f":"IF(C341=\"\",\"\",ROW()-ROW($A$3))","v":""},{"$f":"IF(سفارشات!H339<>0,سفارشات!C339,\"\")","v":""},{"$f":"IF(سفارشات!H339<>0,سفارشات!B339,\"\")","v":""},{"$f":"IF(سفارشات!H339<>0,سفارشات!D339,\"\")","v":""},{"$f":"IF(سفارشات!H339<>0,سفارشات!E339,\"\")","v":""},{"$f":"IF(سفارشات!H339<>0,سفارشات!F339,\"\")","v":""},{"$f":"IF(C341=\"\",\"\",E341-F341)","v":""}]
[{"$f":"IF(C342=\"\",\"\",ROW()-ROW($A$3))","v":""},{"$f":"IF(سفارشات!H340<>0,سفارشات!C340,\"\")","v":""},{"$f":"IF(سفارشات!H340<>0,سفارشات!B340,\"\")","v":""},{"$f":"IF(سفارشات!H340<>0,سفارشات!D340,\"\")","v":""},{"$f":"IF(سفارشات!H340<>0,سفارشات!E340,\"\")","v":""},{"$f":"IF(سفارشات!H340<>0,سفارشات!F340,\"\")","v":""},{"$f":"IF(C342=\"\",\"\",E342-F342)","v":""}]
[{"$f":"IF(C343=\"\",\"\",ROW()-ROW($A$3))","v":""},{"$f":"IF(سفارشات!H341<>0,سفارشات!C341,\"\")","v":""},{"$f":"IF(سفارشات!H341<>0,سفارشات!B341,\"\")","v":""},{"$f":"IF(سفارشات!H341<>0,سفارشات!D341,\"\")","v":""},{"$f":"IF(سفارشات!H341<>0,سفارشات!E341,\"\")","v":""},{"$f":"IF(سفارشات!H341<>0,سفارشات!F341,\"\")","v":""},{"$f":"IF(C343=\"\",\"\",E343-F343)","v":""}]
[{"$f":"IF(C344=\"\",\"\",ROW()-ROW($A$3))","v":""},{"$f":"IF(سفارشات!H342<>0,سفارشات!C342,\"\")","v":""},{"$f":"IF(سفارشات!H342<>0,سفارشات!B342,\"\")","v":""},{"$f":"IF(سفارشات!H342<>0,سفارشات!D342,\"\")","v":""},{"$f":"IF(سفارشات!H342<>0,سفارشات!E342,\"\")","v":""},{"$f":"IF(سفارشات!H342<>0,سفارشات!F342,\"\")","v":""},{"$f":"IF(C344=\"\",\"\",E344-F344)","v":""}]
[{"$f":"IF(C345=\"\",\"\",ROW()-ROW($A$3))","v":""},{"$f":"IF(سفارشات!H343<>0,سفارشات!C343,\"\")","v":""},{"$f":"IF(سفارشات!H343<>0,سفارشات!B343,\"\")","v":""},{"$f":"IF(سفارشات!H343<>0,سفارشات!D343,\"\")","v":""},{"$f":"IF(سفارشات!H343<>0,سفارشات!E343,\"\")","v":""},{"$f":"IF(سفارشات!H343<>0,سفارشات!F343,\"\")","v":""},{"$f":"IF(C345=\"\",\"\",E345-F345)","v":""}]
[{"$f":"IF(C346=\"\",\"\",ROW()-ROW($A$3))","v":""},{"$f":"IF(سفارشات!H344<>0,سفارشات!C344,\"\")","v":""},{"$f":"IF(سفارشات!H344<>0,سفارشات!B344,\"\")","v":""},{"$f":"IF(سفارشات!H344<>0,سفارشات!D344,\"\")","v":""},{"$f":"IF(سفارشات!H344<>0,سفارشات!E344,\"\")","v":""},{"$f":"IF(سفارشات!H344<>0,سفارشات!F344,\"\")","v":""},{"$f":"IF(C346=\"\",\"\",E346-F346)","v":""}]
[{"$f":"IF(C347=\"\",\"\",ROW()-ROW($A$3))","v":""},{"$f":"IF(سفارشات!H345<>0,سفارشات!C345,\"\")","v":""},{"$f":"IF(سفارشات!H345<>0,سفارشات!B345,\"\")","v":""},{"$f":"IF(سفارشات!H345<>0,سفارشات!D345,\"\")","v":""},{"$f":"IF(سفارشات!H345<>0,سفارشات!E345,\"\")","v":""},{"$f":"IF(سفارشات!H345<>0,سفارشات!F345,\"\")","v":""},{"$f":"IF(C347=\"\",\"\",E347-F347)","v":""}]
[{"$f":"IF(C348=\"\",\"\",ROW()-ROW($A$3))","v":""},{"$f":"IF(سفارشات!H346<>0,سفارشات!C346,\"\")","v":""},{"$f":"IF(سفارشات!H346<>0,سفارشات!B346,\"\")","v":""},{"$f":"IF(سفارشات!H346<>0,سفارشات!D346,\"\")","v":""},{"$f":"IF(سفارشات!H346<>0,سفارشات!E346,\"\")","v":""},{"$f":"IF(سفارشات!H346<>0,سفارشات!F346,\"\")","v":""},{"$f":"IF(C348=\"\",\"\",E348-F348)","v":""}]
[{"$f":"IF(C349=\"\",\"\",ROW()-ROW($A$3))","v":""},{"$f":"IF(سفارشات!H347<>0,سفارشات!C347,\"\")","v":""},{"$f":"IF(سفارشات!H347<>0,سفارشات!B347,\"\")","v":""},{"$f":"IF(سفارشات!H347<>0,سفارشات!D347,\"\")","v":""},{"$f":"IF(سفارشات!H347<>0,سفارشات!E347,\"\")","v":""},{"$f":"IF(سفارشات!H347<>0,سفارشات!F347,\"\")","v":""},{"$f":"IF(C349=\"\",\"\",E349-F349)","v":""}]
[{"$f":"IF(C350=\"\",\"\",ROW()-ROW($A$3))","v":""},{"$f":"IF(سفارشات!H348<>0,سفارشات!C348,\"\")","v":""},{"$f":"IF(سفارشات!H348<>0,سفارشات!B348,\"\")","v":""},{"$f":"IF(سفارشات!H348<>0,سفارشات!D348,\"\")","v":""},{"$f":"IF(سفارشات!H348<>0,سفارشات!E348,\"\")","v":""},{"$f":"IF(سفارشات!H348<>0,سفارشات!F348,\"\")","v":""},{"$f":"IF(C350=\"\",\"\",E350-F350)","v":""}]
[{"$f":"IF(C351=\"\",\"\",ROW()-ROW($A$3))","v":""},{"$f":"IF(سفارشات!H349<>0,سفارشات!C349,\"\")","v":""},{"$f":"IF(سفارشات!H349<>0,سفارشات!B349,\"\")","v":""},{"$f":"IF(سفارشات!H349<>0,سفارشات!D349,\"\")","v":""},{"$f":"IF(سفارشات!H349<>0,سفارشات!E349,\"\")","v":""},{"$f":"IF(سفارشات!H349<>0,سفارشات!F349,\"\")","v":""},{"$f":"IF(C351=\"\",\"\",E351-F351)","v":""}]
[{"$f":"IF(C352=\"\",\"\",ROW()-ROW($A$3))","v":""},{"$f":"IF(سفارشات!H350<>0,سفارشات!C350,\"\")","v":""},{"$f":"IF(سفارشات!H350<>0,سفارشات!B350,\"\")","v":""},{"$f":"IF(سفارشات!H350<>0,سفارشات!D350,\"\")","v":""},{"$f":"IF(سفارشات!H350<>0,سفارشات!E350,\"\")","v":""},{"$f":"IF(سفارشات!H350<>0,سفارشات!F350,\"\")","v":""},{"$f":"IF(C352=\"\",\"\",E352-F352)","v":""}]
[{"$f":"IF(C353=\"\",\"\",ROW()-ROW($A$3))","v":""},{"$f":"IF(سفارشات!H351<>0,سفارشات!C351,\"\")","v":""},{"$f":"IF(سفارشات!H351<>0,سفارشات!B351,\"\")","v":""},{"$f":"IF(سفارشات!H351<>0,سفارشات!D351,\"\")","v":""},{"$f":"IF(سفارشات!H351<>0,سفارشات!E351,\"\")","v":""},{"$f":"IF(سفارشات!H351<>0,سفارشات!F351,\"\")","v":""},{"$f":"IF(C353=\"\",\"\",E353-F353)","v":""}]
[{"$f":"IF(C354=\"\",\"\",ROW()-ROW($A$3))","v":""},{"$f":"IF(سفارشات!H352<>0,سفارشات!C352,\"\")","v":""},{"$f":"IF(سفارشات!H352<>0,سفارشات!B352,\"\")","v":""},{"$f":"IF(سفارشات!H352<>0,سفارشات!D352,\"\")","v":""},{"$f":"IF(سفارشات!H352<>0,سفارشات!E352,\"\")","v":""},{"$f":"IF(سفارشات!H352<>0,سفارشات!F352,\"\")","v":""},{"$f":"IF(C354=\"\",\"\",E354-F354)","v":""}]
[{"$f":"IF(C355=\"\",\"\",ROW()-ROW($A$3))","v":""},{"$f":"IF(سفارشات!H353<>0,سفارشات!C353,\"\")","v":""},{"$f":"IF(سفارشات!H353<>0,سفارشات!B353,\"\")","v":""},{"$f":"IF(سفارشات!H353<>0,سفارشات!D353,\"\")","v":""},{"$f":"IF(سفارشات!H353<>0,سفارشات!E353,\"\")","v":""},{"$f":"IF(سفارشات!H353<>0,سفارشات!F353,\"\")","v":""},{"$f":"IF(C355=\"\",\"\",E355-F355)","v":""}]
[{"$f":"IF(C356=\"\",\"\",ROW()-ROW($A$3))","v":""},{"$f":"IF(سفارشات!H354<>0,سفارشات!C354,\"\")","v":""},{"$f":"IF(سفارشات!H354<>0,سفارشات!B354,\"\")","v":""},{"$f":"IF(سفارشات!H354<>0,سفارشات!D354,\"\")","v":""},{"$f":"IF(سفارشات!H354<>0,سفارشات!E354,\"\")","v":""},{"$f":"IF(سفارشات!H354<>0,سفارشات!F354,\"\")","v":""},{"$f":"IF(C356=\"\",\"\",E356-F356)","v":""}]
[{"$f":"IF(C357=\"\",\"\",ROW()-ROW($A$3))","v":""},{"$f":"IF(سفارشات!H355<>0,سفارشات!C355,\"\")","v":""},{"$f":"IF(سفارشات!H355<>0,سفارشات!B355,\"\")","v":""},{"$f":"IF(سفارشات!H355<>0,سفارشات!D355,\"\")","v":""},{"$f":"IF(سفارشات!H355<>0,سفارشات!E355,\"\")","v":""},{"$f":"IF(سفارشات!H355<>0,سفارشات!F355,\"\")","v":""},{"$f":"IF(C357=\"\",\"\",E357-F357)","v":""}]
[{"$f":"IF(C358=\"\",\"\",ROW()-ROW($A$3))","v":""},{"$f":"IF(سفارشات!H356<>0,سفارشات!C356,\"\")","v":""},{"$f":"IF(سفارشات!H356<>0,سفارشات!B356,\"\")","v":""},{"$f":"IF(سفارشات!H356<>0,سفارشات!D356,\"\")","v":""},{"$f":"IF(سفارشات!H356<>0,سفارشات!E356,\"\")","v":""},{"$f":"IF(سفارشات!H356<>0,سفارشات!F356,\"\")","v":""},{"$f":"IF(C358=\"\",\"\",E358-F358)","v":""}]
[{"$f":"IF(C359=\"\",\"\",ROW()-ROW($A$3))","v":""},{"$f":"IF(سفارشات!H357<>0,سفارشات!C357,\"\")","v":""},{"$f":"IF(سفارشات!H357<>0,سفارشات!B357,\"\")","v":""},{"$f":"IF(سفارشات!H357<>0,سفارشات!D357,\"\")","v":""},{"$f":"IF(سفارشات!H357<>0,سفارشات!E357,\"\")","v":""},{"$f":"IF(سفارشات!H357<>0,سفارشات!F357,\"\")","v":""},{"$f":"IF(C359=\"\",\"\",E359-F359)","v":""}]
[{"$f":"IF(C360=\"\",\"\",ROW()-ROW($A$3))","v":""},{"$f":"IF(سفارشات!H358<>0,سفارشات!C358,\"\")","v":""},{"$f":"IF(سفارشات!H358<>0,سفارشات!B358,\"\")","v":""},{"$f":"IF(سفارشات!H358<>0,سفارشات!D358,\"\")","v":""},{"$f":"IF(سفارشات!H358<>0,سفارشات!E358,\"\")","v":""},{"$f":"IF(سفارشات!H358<>0,سفارشات!F358,\"\")","v":""},{"$f":"IF(C360=\"\",\"\",E360-F360)","v":""}]
[{"$f":"IF(C361=\"\",\"\",ROW()-ROW($A$3))","v":""},{"$f":"IF(سفارشات!H359<>0,سفارشات!C359,\"\")","v":""},{"$f":"IF(سفارشات!H359<>0,سفارشات!B359,\"\")","v":""},{"$f":"IF(سفارشات!H359<>0,سفارشات!D359,\"\")","v":""},{"$f":"IF(سفارشات!H359<>0,سفارشات!E359,\"\")","v":""},{"$f":"IF(سفارشات!H359<>0,سفارشات!F359,\"\")","v":""},{"$f":"IF(C361=\"\",\"\",E361-F361)","v":""}]
[{"$f":"IF(C362=\"\",\"\",ROW()-ROW($A$3))","v":""},{"$f":"IF(سفارشات!H360<>0,سفارشات!C360,\"\")","v":""},{"$f":"IF(سفارشات!H360<>0,سفارشات!B360,\"\")","v":""},{"$f":"IF(سفارشات!H360<>0,سفارشات!D360,\"\")","v":""},{"$f":"IF(سفارشات!H360<>0,سفارشات!E360,\"\")","v":""},{"$f":"IF(سفارشات!H360<>0,سفارشات!F360,\"\")","v":""},{"$f":"IF(C362=\"\",\"\",E362-F362)","v":""}]
[{"$f":"IF(C363=\"\",\"\",ROW()-ROW($A$3))","v":""},{"$f":"IF(سفارشات!H361<>0,سفارشات!C361,\"\")","v":""},{"$f":"IF(سفارشات!H361<>0,سفارشات!B361,\"\")","v":""},{"$f":"IF(سفارشات!H361<>0,سفارشات!D361,\"\")","v":""},{"$f":"IF(سفارشات!H361<>0,سفارشات!E361,\"\")","v":""},{"$f":"IF(سفارشات!H361<>0,سفارشات!F361,\"\")","v":""},{"$f":"IF(C363=\"\",\"\",E363-F363)","v":""}]
[{"$f":"IF(C364=\"\",\"\",ROW()-ROW($A$3))","v":""},{"$f":"IF(سفارشات!H362<>0,سفارشات!C362,\"\")","v":""},{"$f":"IF(سفارشات!H362<>0,سفارشات!B362,\"\")","v":""},{"$f":"IF(سفارشات!H362<>0,سفارشات!D362,\"\")","v":""},{"$f":"IF(سفارشات!H362<>0,سفارشات!E362,\"\")","v":""},{"$f":"IF(سفارشات!H362<>0,سفارشات!F362,\"\")","v":""},{"$f":"IF(C364=\"\",\"\",E364-F364)","v":""}]
[{"$f":"IF(C365=\"\",\"\",ROW()-ROW($A$3))","v":""},{"$f":"IF(سفارشات!H363<>0,سفارشات!C363,\"\")","v":""},{"$f":"IF(سفارشات!H363<>0,سفارشات!B363,\"\")","v":""},{"$f":"IF(سفارشات!H363<>0,سفارشات!D363,\"\")","v":""},{"$f":"IF(سفارشات!H363<>0,سفارشات!E363,\"\")","v":""},{"$f":"IF(سفارشات!H363<>0,سفارشات!F363,\"\")","v":""},{"$f":"IF(C365=\"\",\"\",E365-F365)","v":""}]
[{"$f":"IF(C366=\"\",\"\",ROW()-ROW($A$3))","v":""},{"$f":"IF(سفارشات!H364<>0,سفارشات!C364,\"\")","v":""},{"$f":"IF(سفارشات!H364<>0,سفارشات!B364,\"\")","v":""},{"$f":"IF(سفارشات!H364<>0,سفارشات!D364,\"\")","v":""},{"$f":"IF(سفارشات!H364<>0,سفارشات!E364,\"\")","v":""},{"$f":"IF(سفارشات!H364<>0,سفارشات!F364,\"\")","v":""},{"$f":"IF(C366=\"\",\"\",E366-F366)","v":""}]
[{"$f":"IF(C367=\"\",\"\",ROW()-ROW($A$3))","v":""},{"$f":"IF(سفارشات!H365<>0,سفارشات!C365,\"\")","v":""},{"$f":"IF(سفارشات!H365<>0,سفارشات!B365,\"\")","v":""},{"$f":"IF(سفارشات!H365<>0,سفارشات!D365,\"\")","v":""},{"$f":"IF(سفارشات!H365<>0,سفارشات!E365,\"\")","v":""},{"$f":"IF(سفارشات!H365<>0,سفارشات!F365,\"\")","v":""},{"$f":"IF(C367=\"\",\"\",E367-F367)","v":""}]
[{"$f":"IF(C368=\"\",\"\",ROW()-ROW($A$3))","v":""},{"$f":"IF(سفارشات!H366<>0,سفارشات!C366,\"\")","v":""},{"$f":"IF(سفارشات!H366<>0,سفارشات!B366,\"\")","v":""},{"$f":"IF(سفارشات!H366<>0,سفارشات!D366,\"\")","v":""},{"$f":"IF(سفارشات!H366<>0,سفارشات!E366,\"\")","v":""},{"$f":"IF(سفارشات!H366<>0,سفارشات!F366,\"\")","v":""},{"$f":"IF(C368=\"\",\"\",E368-F368)","v":""}]
[{"$f":"IF(C369=\"\",\"\",ROW()-ROW($A$3))","v":""},{"$f":"IF(سفارشات!H367<>0,سفارشات!C367,\"\")","v":""},{"$f":"IF(سفارشات!H367<>0,سفارشات!B367,\"\")","v":""},{"$f":"IF(سفارشات!H367<>0,سفارشات!D367,\"\")","v":""},{"$f":"IF(سفارشات!H367<>0,سفارشات!E367,\"\")","v":""},{"$f":"IF(سفارشات!H367<>0,سفارشات!F367,\"\")","v":""},{"$f":"IF(C369=\"\",\"\",E369-F369)","v":""}]
[{"$f":"IF(C370=\"\",\"\",ROW()-ROW($A$3))","v":""},{"$f":"IF(سفارشات!H368<>0,سفارشات!C368,\"\")","v":""},{"$f":"IF(سفارشات!H368<>0,سفارشات!B368,\"\")","v":""},{"$f":"IF(سفارشات!H368<>0,سفارشات!D368,\"\")","v":""},{"$f":"IF(سفارشات!H368<>0,سفارشات!E368,\"\")","v":""},{"$f":"IF(سفارشات!H368<>0,سفارشات!F368,\"\")","v":""},{"$f":"IF(C370=\"\",\"\",E370-F370)","v":""}]
[{"$f":"IF(C371=\"\",\"\",ROW()-ROW($A$3))","v":""},{"$f":"IF(سفارشات!H369<>0,سفارشات!C369,\"\")","v":""},{"$f":"IF(سفارشات!H369<>0,سفارشات!B369,\"\")","v":""},{"$f":"IF(سفارشات!H369<>0,سفارشات!D369,\"\")","v":""},{"$f":"IF(سفارشات!H369<>0,سفارشات!E369,\"\")","v":""},{"$f":"IF(سفارشات!H369<>0,سفارشات!F369,\"\")","v":""},{"$f":"IF(C371=\"\",\"\",E371-F371)","v":""}]
[{"$f":"IF(C372=\"\",\"\",ROW()-ROW($A$3))","v":""},{"$f":"IF(سفارشات!H370<>0,سفارشات!C370,\"\")","v":""},{"$f":"IF(سفارشات!H370<>0,سفارشات!B370,\"\")","v":""},{"$f":"IF(سفارشات!H370<>0,سفارشات!D370,\"\")","v":""},{"$f":"IF(سفارشات!H370<>0,سفارشات!E370,\"\")","v":""},{"$f":"IF(سفارشات!H370<>0,سفارشات!F370,\"\")","v":""},{"$f":"IF(C372=\"\",\"\",E372-F372)","v":""}]
[{"$f":"IF(C373=\"\",\"\",ROW()-ROW($A$3))","v":""},{"$f":"IF(سفارشات!H371<>0,سفارشات!C371,\"\")","v":""},{"$f":"IF(سفارشات!H371<>0,سفارشات!B371,\"\")","v":""},{"$f":"IF(سفارشات!H371<>0,سفارشات!D371,\"\")","v":""},{"$f":"IF(سفارشات!H371<>0,سفارشات!E371,\"\")","v":""},{"$f":"IF(سفارشات!H371<>0,سفارشات!F371,\"\")","v":""},{"$f":"IF(C373=\"\",\"\",E373-F373)","v":""}]
[{"$f":"IF(C374=\"\",\"\",ROW()-ROW($A$3))","v":""},{"$f":"IF(سفارشات!H372<>0,سفارشات!C372,\"\")","v":""},{"$f":"IF(سفارشات!H372<>0,سفارشات!B372,\"\")","v":""},{"$f":"IF(سفارشات!H372<>0,سفارشات!D372,\"\")","v":""},{"$f":"IF(سفارشات!H372<>0,سفارشات!E372,\"\")","v":""},{"$f":"IF(سفارشات!H372<>0,سفارشات!F372,\"\")","v":""},{"$f":"IF(C374=\"\",\"\",E374-F374)","v":""}]
[{"$f":"IF(C375=\"\",\"\",ROW()-ROW($A$3))","v":""},{"$f":"IF(سفارشات!H373<>0,سفارشات!C373,\"\")","v":""},{"$f":"IF(سفارشات!H373<>0,سفارشات!B373,\"\")","v":""},{"$f":"IF(سفارشات!H373<>0,سفارشات!D373,\"\")","v":""},{"$f":"IF(سفارشات!H373<>0,سفارشات!E373,\"\")","v":""},{"$f":"IF(سفارشات!H373<>0,سفارشات!F373,\"\")","v":""},{"$f":"IF(C375=\"\",\"\",E375-F375)","v":""}]
[{"$f":"IF(C376=\"\",\"\",ROW()-ROW($A$3))","v":""},{"$f":"IF(سفارشات!H374<>0,سفارشات!C374,\"\")","v":""},{"$f":"IF(سفارشات!H374<>0,سفارشات!B374,\"\")","v":""},{"$f":"IF(سفارشات!H374<>0,سفارشات!D374,\"\")","v":""},{"$f":"IF(سفارشات!H374<>0,سفارشات!E374,\"\")","v":""},{"$f":"IF(سفارشات!H374<>0,سفارشات!F374,\"\")","v":""},{"$f":"IF(C376=\"\",\"\",E376-F376)","v":""}]
[{"$f":"IF(C377=\"\",\"\",ROW()-ROW($A$3))","v":""},{"$f":"IF(سفارشات!H375<>0,سفارشات!C375,\"\")","v":""},{"$f":"IF(سفارشات!H375<>0,سفارشات!B375,\"\")","v":""},{"$f":"IF(سفارشات!H375<>0,سفارشات!D375,\"\")","v":""},{"$f":"IF(سفارشات!H375<>0,سفارشات!E375,\"\")","v":""},{"$f":"IF(سفارشات!H375<>0,سفارشات!F375,\"\")","v":""},{"$f":"IF(C377=\"\",\"\",E377-F377)","v":""}]
[{"$f":"IF(C378=\"\",\"\",ROW()-ROW($A$3))","v":""},{"$f":"IF(سفارشات!H376<>0,سفارشات!C376,\"\")","v":""},{"$f":"IF(سفارشات!H376<>0,سفارشات!B376,\"\")","v":""},{"$f":"IF(سفارشات!H376<>0,سفارشات!D376,\"\")","v":""},{"$f":"IF(سفارشات!H376<>0,سفارشات!E376,\"\")","v":""},{"$f":"IF(سفارشات!H376<>0,سفارشات!F376,\"\")","v":""},{"$f":"IF(C378=\"\",\"\",E378-F378)","v":""}]
[{"$f":"IF(C379=\"\",\"\",ROW()-ROW($A$3))","v":""},{"$f":"IF(سفارشات!H377<>0,سفارشات!C377,\"\")","v":""},{"$f":"IF(سفارشات!H377<>0,سفارشات!B377,\"\")","v":""},{"$f":"IF(سفارشات!H377<>0,سفارشات!D377,\"\")","v":""},{"$f":"IF(سفارشات!H377<>0,سفارشات!E377,\"\")","v":""},{"$f":"IF(سفارشات!H377<>0,سفارشات!F377,\"\")","v":""},{"$f":"IF(C379=\"\",\"\",E379-F379)","v":""}]
[{"$f":"IF(C380=\"\",\"\",ROW()-ROW($A$3))","v":""},{"$f":"IF(سفارشات!H378<>0,سفارشات!C378,\"\")","v":""},{"$f":"IF(سفارشات!H378<>0,سفارشات!B378,\"\")","v":""},{"$f":"IF(سفارشات!H378<>0,سفارشات!D378,\"\")","v":""},{"$f":"IF(سفارشات!H378<>0,سفارشات!E378,\"\")","v":""},{"$f":"IF(سفارشات!H378<>0,سفارشات!F378,\"\")","v":""},{"$f":"IF(C380=\"\",\"\",E380-F380)","v":""}]
[{"$f":"IF(C381=\"\",\"\",ROW()-ROW($A$3))","v":""},{"$f":"IF(سفارشات!H379<>0,سفارشات!C379,\"\")","v":""},{"$f":"IF(سفارشات!H379<>0,سفارشات!B379,\"\")","v":""},{"$f":"IF(سفارشات!H379<>0,سفارشات!D379,\"\")","v":""},{"$f":"IF(سفارشات!H379<>0,سفارشات!E379,\"\")","v":""},{"$f":"IF(سفارشات!H379<>0,سفارشات!F379,\"\")","v":""},{"$f":"IF(C381=\"\",\"\",E381-F381)","v":""}]
[{"$f":"IF(C382=\"\",\"\",ROW()-ROW($A$3))","v":""},{"$f":"IF(سفارشات!H380<>0,سفارشات!C380,\"\")","v":""},{"$f":"IF(سفارشات!H380<>0,سفارشات!B380,\"\")","v":""},{"$f":"IF(سفارشات!H380<>0,سفارشات!D380,\"\")","v":""},{"$f":"IF(سفارشات!H380<>0,سفارشات!E380,\"\")","v":""},{"$f":"IF(سفارشات!H380<>0,سفارشات!F380,\"\")","v":""},{"$f":"IF(C382=\"\",\"\",E382-F382)","v":""}]
[{"$f":"IF(C383=\"\",\"\",ROW()-ROW($A$3))","v":""},{"$f":"IF(سفارشات!H381<>0,سفارشات!C381,\"\")","v":""},{"$f":"IF(سفارشات!H381<>0,سفارشات!B381,\"\")","v":""},{"$f":"IF(سفارشات!H381<>0,سفارشات!D381,\"\")","v":""},{"$f":"IF(سفارشات!H381<>0,سفارشات!E381,\"\")","v":""},{"$f":"IF(سفارشات!H381<>0,سفارشات!F381,\"\")","v":""},{"$f":"IF(C383=\"\",\"\",E383-F383)","v":""}]
[{"$f":"IF(C384=\"\",\"\",ROW()-ROW($A$3))","v":""},{"$f":"IF(سفارشات!H382<>0,سفارشات!C382,\"\")","v":""},{"$f":"IF(سفارشات!H382<>0,سفارشات!B382,\"\")","v":""},{"$f":"IF(سفارشات!H382<>0,سفارشات!D382,\"\")","v":""},{"$f":"IF(سفارشات!H382<>0,سفارشات!E382,\"\")","v":""},{"$f":"IF(سفارشات!H382<>0,سفارشات!F382,\"\")","v":""},{"$f":"IF(C384=\"\",\"\",E384-F384)","v":""}]
[{"$f":"IF(C385=\"\",\"\",ROW()-ROW($A$3))","v":""},{"$f":"IF(سفارشات!H383<>0,سفارشات!C383,\"\")","v":""},{"$f":"IF(سفارشات!H383<>0,سفارشات!B383,\"\")","v":""},{"$f":"IF(سفارشات!H383<>0,سفارشات!D383,\"\")","v":""},{"$f":"IF(سفارشات!H383<>0,سفارشات!E383,\"\")","v":""},{"$f":"IF(سفارشات!H383<>0,سفارشات!F383,\"\")","v":""},{"$f":"IF(C385=\"\",\"\",E385-F385)","v":""}]
[{"$f":"IF(C386=\"\",\"\",ROW()-ROW($A$3))","v":""},{"$f":"IF(سفارشات!H384<>0,سفارشات!C384,\"\")","v":""},{"$f":"IF(سفارشات!H384<>0,سفارشات!B384,\"\")","v":""},{"$f":"IF(سفارشات!H384<>0,سفارشات!D384,\"\")","v":""},{"$f":"IF(سفارشات!H384<>0,سفارشات!E384,\"\")","v":""},{"$f":"IF(سفارشات!H384<>0,سفارشات!F384,\"\")","v":""},{"$f":"IF(C386=\"\",\"\",E386-F386)","v":""}]
[{"$f":"IF(C387=\"\",\"\",ROW()-ROW($A$3))","v":""},{"$f":"IF(سفارشات!H385<>0,سفارشات!C385,\"\")","v":""},{"$f":"IF(سفارشات!H385<>0,سفارشات!B385,\"\")","v":""},{"$f":"IF(سفارشات!H385<>0,سفارشات!D385,\"\")","v":""},{"$f":"IF(سفارشات!H385<>0,سفارشات!E385,\"\")","v":""},{"$f":"IF(سفارشات!H385<>0,سفارشات!F385,\"\")","v":""},{"$f":"IF(C387=\"\",\"\",E387-F387)","v":""}]
[{"$f":"IF(C388=\"\",\"\",ROW()-ROW($A$3))","v":""},{"$f":"IF(سفارشات!H386<>0,سفارشات!C386,\"\")","v":""},{"$f":"IF(سفارشات!H386<>0,سفارشات!B386,\"\")","v":""},{"$f":"IF(سفارشات!H386<>0,سفارشات!D386,\"\")","v":""},{"$f":"IF(سفارشات!H386<>0,سفارشات!E386,\"\")","v":""},{"$f":"IF(سفارشات!H386<>0,سفارشات!F386,\"\")","v":""},{"$f":"IF(C388=\"\",\"\",E388-F388)","v":""}]
[{"$f":"IF(C389=\"\",\"\",ROW()-ROW($A$3))","v":""},{"$f":"IF(سفارشات!H387<>0,سفارشات!C387,\"\")","v":""},{"$f":"IF(سفارشات!H387<>0,سفارشات!B387,\"\")","v":""},{"$f":"IF(سفارشات!H387<>0,سفارشات!D387,\"\")","v":""},{"$f":"IF(سفارشات!H387<>0,سفارشات!E387,\"\")","v":""},{"$f":"IF(سفارشات!H387<>0,سفارشات!F387,\"\")","v":""},{"$f":"IF(C389=\"\",\"\",E389-F389)","v":""}]
[{"$f":"IF(C390=\"\",\"\",ROW()-ROW($A$3))","v":""},{"$f":"IF(سفارشات!H388<>0,سفارشات!C388,\"\")","v":""},{"$f":"IF(سفارشات!H388<>0,سفارشات!B388,\"\")","v":""},{"$f":"IF(سفارشات!H388<>0,سفارشات!D388,\"\")","v":""},{"$f":"IF(سفارشات!H388<>0,سفارشات!E388,\"\")","v":""},{"$f":"IF(سفارشات!H388<>0,سفارشات!F388,\"\")","v":""},{"$f":"IF(C390=\"\",\"\",E390-F390)","v":""}]
[{"$f":"IF(C391=\"\",\"\",ROW()-ROW($A$3))","v":""},{"$f":"IF(سفارشات!H389<>0,سفارشات!C389,\"\")","v":""},{"$f":"IF(سفارشات!H389<>0,سفارشات!B389,\"\")","v":""},{"$f":"IF(سفارشات!H389<>0,سفارشات!D389,\"\")","v":""},{"$f":"IF(سفارشات!H389<>0,سفارشات!E389,\"\")","v":""},{"$f":"IF(سفارشات!H389<>0,سفارشات!F389,\"\")","v":""},{"$f":"IF(C391=\"\",\"\",E391-F391)","v":""}]
[{"$f":"IF(C392=\"\",\"\",ROW()-ROW($A$3))","v":""},{"$f":"IF(سفارشات!H390<>0,سفارشات!C390,\"\")","v":""},{"$f":"IF(سفارشات!H390<>0,سفارشات!B390,\"\")","v":""},{"$f":"IF(سفارشات!H390<>0,سفارشات!D390,\"\")","v":""},{"$f":"IF(سفارشات!H390<>0,سفارشات!E390,\"\")","v":""},{"$f":"IF(سفارشات!H390<>0,سفارشات!F390,\"\")","v":""},{"$f":"IF(C392=\"\",\"\",E392-F392)","v":""}]
[{"$f":"IF(C393=\"\",\"\",ROW()-ROW($A$3))","v":""},{"$f":"IF(سفارشات!H391<>0,سفارشات!C391,\"\")","v":""},{"$f":"IF(سفارشات!H391<>0,سفارشات!B391,\"\")","v":""},{"$f":"IF(سفارشات!H391<>0,سفارشات!D391,\"\")","v":""},{"$f":"IF(سفارشات!H391<>0,سفارشات!E391,\"\")","v":""},{"$f":"IF(سفارشات!H391<>0,سفارشات!F391,\"\")","v":""},{"$f":"IF(C393=\"\",\"\",E393-F393)","v":""}]
[{"$f":"IF(C394=\"\",\"\",ROW()-ROW($A$3))","v":""},{"$f":"IF(سفارشات!H392<>0,سفارشات!C392,\"\")","v":""},{"$f":"IF(سفارشات!H392<>0,سفارشات!B392,\"\")","v":""},{"$f":"IF(سفارشات!H392<>0,سفارشات!D392,\"\")","v":""},{"$f":"IF(سفارشات!H392<>0,سفارشات!E392,\"\")","v":""},{"$f":"IF(سفارشات!H392<>0,سفارشات!F392,\"\")","v":""},{"$f":"IF(C394=\"\",\"\",E394-F394)","v":""}]
[{"$f":"IF(C395=\"\",\"\",ROW()-ROW($A$3))","v":""},{"$f":"IF(سفارشات!H393<>0,سفارشات!C393,\"\")","v":""},{"$f":"IF(سفارشات!H393<>0,سفارشات!B393,\"\")","v":""},{"$f":"IF(سفارشات!H393<>0,سفارشات!D393,\"\")","v":""},{"$f":"IF(سفارشات!H393<>0,سفارشات!E393,\"\")","v":""},{"$f":"IF(سفارشات!H393<>0,سفارشات!F393,\"\")","v":""},{"$f":"IF(C395=\"\",\"\",E395-F395)","v":""}]
[{"$f":"IF(C396=\"\",\"\",ROW()-ROW($A$3))","v":""},{"$f":"IF(سفارشات!H394<>0,سفارشات!C394,\"\")","v":""},{"$f":"IF(سفارشات!H394<>0,سفارشات!B394,\"\")","v":""},{"$f":"IF(سفارشات!H394<>0,سفارشات!D394,\"\")","v":""},{"$f":"IF(سفارشات!H394<>0,سفارشات!E394,\"\")","v":""},{"$f":"IF(سفارشات!H394<>0,سفارشات!F394,\"\")","v":""},{"$f":"IF(C396=\"\",\"\",E396-F396)","v":""}]
[{"$f":"IF(C397=\"\",\"\",ROW()-ROW($A$3))","v":""},{"$f":"IF(سفارشات!H395<>0,سفارشات!C395,\"\")","v":""},{"$f":"IF(سفارشات!H395<>0,سفارشات!B395,\"\")","v":""},{"$f":"IF(سفارشات!H395<>0,سفارشات!D395,\"\")","v":""},{"$f":"IF(سفارشات!H395<>0,سفارشات!E395,\"\")","v":""},{"$f":"IF(سفارشات!H395<>0,سفارشات!F395,\"\")","v":""},{"$f":"IF(C397=\"\",\"\",E397-F397)","v":""}]
[{"$f":"IF(C398=\"\",\"\",ROW()-ROW($A$3))","v":""},{"$f":"IF(سفارشات!H396<>0,سفارشات!C396,\"\")","v":""},{"$f":"IF(سفارشات!H396<>0,سفارشات!B396,\"\")","v":""},{"$f":"IF(سفارشات!H396<>0,سفارشات!D396,\"\")","v":""},{"$f":"IF(سفارشات!H396<>0,سفارشات!E396,\"\")","v":""},{"$f":"IF(سفارشات!H396<>0,سفارشات!F396,\"\")","v":""},{"$f":"IF(C398=\"\",\"\",E398-F398)","v":""}]
[{"$f":"IF(C399=\"\",\"\",ROW()-ROW($A$3))","v":""},{"$f":"IF(سفارشات!H397<>0,سفارشات!C397,\"\")","v":""},{"$f":"IF(سفارشات!H397<>0,سفارشات!B397,\"\")","v":""},{"$f":"IF(سفارشات!H397<>0,سفارشات!D397,\"\")","v":""},{"$f":"IF(سفارشات!H397<>0,سفارشات!E397,\"\")","v":""},{"$f":"IF(سفارشات!H397<>0,سفارشات!F397,\"\")","v":""},{"$f":"IF(C399=\"\",\"\",E399-F399)","v":""}]
[{"$f":"IF(C400=\"\",\"\",ROW()-ROW($A$3))","v":""},{"$f":"IF(سفارشات!H398<>0,سفارشات!C398,\"\")","v":""},{"$f":"IF(سفارشات!H398<>0,سفارشات!B398,\"\")","v":""},{"$f":"IF(سفارشات!H398<>0,سفارشات!D398,\"\")","v":""},{"$f":"IF(سفارشات!H398<>0,سفارشات!E398,\"\")","v":""},{"$f":"IF(سفارشات!H398<>0,سفارشات!F398,\"\")","v":""},{"$f":"IF(C400=\"\",\"\",E400-F400)","v":""}]
[{"$f":"IF(C401=\"\",\"\",ROW()-ROW($A$3))","v":""},{"$f":"IF(سفارشات!H399<>0,سفارشات!C399,\"\")","v":""},{"$f":"IF(سفارشات!H399<>0,سفارشات!B399,\"\")","v":""},{"$f":"IF(سفارشات!H399<>0,سفارشات!D399,\"\")","v":""},{"$f":"IF(سفارشات!H399<>0,سفارشات!E399,\"\")","v":""},{"$f":"IF(سفارشات!H399<>0,سفارشات!F399,\"\")","v":""},{"$f":"IF(C401=\"\",\"\",E401-F401)","v":""}]
[{"$f":"IF(C402=\"\",\"\",ROW()-ROW($A$3))","v":""},{"$f":"IF(سفارشات!H400<>0,سفارشات!C400,\"\")","v":""},{"$f":"IF(سفارشات!H400<>0,سفارشات!B400,\"\")","v":""},{"$f":"IF(سفارشات!H400<>0,سفارشات!D400,\"\")","v":""},{"$f":"IF(سفارشات!H400<>0,سفارشات!E400,\"\")","v":""},{"$f":"IF(سفارشات!H400<>0,سفارشات!F400,\"\")","v":""},{"$f":"IF(C402=\"\",\"\",E402-F402)","v":""}]
[{"$f":"IF(C403=\"\",\"\",ROW()-ROW($A$3))","v":""},{"$f":"IF(سفارشات!H401<>0,سفارشات!C401,\"\")","v":""},{"$f":"IF(سفارشات!H401<>0,سفارشات!B401,\"\")","v":""},{"$f":"IF(سفارشات!H401<>0,سفارشات!D401,\"\")","v":""},{"$f":"IF(سفارشات!H401<>0,سفارشات!E401,\"\")","v":""},{"$f":"IF(سفارشات!H401<>0,سفارشات!F401,\"\")","v":""},{"$f":"IF(C403=\"\",\"\",E403-F403)","v":""}]
[{"$f":"IF(C404=\"\",\"\",ROW()-ROW($A$3))","v":""},{"$f":"IF(سفارشات!H402<>0,سفارشات!C402,\"\")","v":""},{"$f":"IF(سفارشات!H402<>0,سفارشات!B402,\"\")","v":""},{"$f":"IF(سفارشات!H402<>0,سفارشات!D402,\"\")","v":""},{"$f":"IF(سفارشات!H402<>0,سفارشات!E402,\"\")","v":""},{"$f":"IF(سفارشات!H402<>0,سفارشات!F402,\"\")","v":""},{"$f":"IF(C404=\"\",\"\",E404-F404)","v":""}]
[{"$f":"IF(C405=\"\",\"\",ROW()-ROW($A$3))","v":""},{"$f":"IF(سفارشات!H403<>0,سفارشات!C403,\"\")","v":""},{"$f":"IF(سفارشات!H403<>0,سفارشات!B403,\"\")","v":""},{"$f":"IF(سفارشات!H403<>0,سفارشات!D403,\"\")","v":""},{"$f":"IF(سفارشات!H403<>0,سفارشات!E403,\"\")","v":""},{"$f":"IF(سفارشات!H403<>0,سفارشات!F403,\"\")","v":""},{"$f":"IF(C405=\"\",\"\",E405-F405)","v":""}]
[{"$f":"IF(C406=\"\",\"\",ROW()-ROW($A$3))","v":""},{"$f":"IF(سفارشات!H404<>0,سفارشات!C404,\"\")","v":""},{"$f":"IF(سفارشات!H404<>0,سفارشات!B404,\"\")","v":""},{"$f":"IF(سفارشات!H404<>0,سفارشات!D404,\"\")","v":""},{"$f":"IF(سفارشات!H404<>0,سفارشات!E404,\"\")","v":""},{"$f":"IF(سفارشات!H404<>0,سفارشات!F404,\"\")","v":""},{"$f":"IF(C406=\"\",\"\",E406-F406)","v":""}]
[{"$f":"IF(C407=\"\",\"\",ROW()-ROW($A$3))","v":""},{"$f":"IF(سفارشات!H405<>0,سفارشات!C405,\"\")","v":""},{"$f":"IF(سفارشات!H405<>0,سفارشات!B405,\"\")","v":""},{"$f":"IF(سفارشات!H405<>0,سفارشات!D405,\"\")","v":""},{"$f":"IF(سفارشات!H405<>0,سفارشات!E405,\"\")","v":""},{"$f":"IF(سفارشات!H405<>0,سفارشات!F405,\"\")","v":""},{"$f":"IF(C407=\"\",\"\",E407-F407)","v":""}]
[{"$f":"IF(C408=\"\",\"\",ROW()-ROW($A$3))","v":""},{"$f":"IF(سفارشات!H406<>0,سفارشات!C406,\"\")","v":""},{"$f":"IF(سفارشات!H406<>0,سفارشات!B406,\"\")","v":""},{"$f":"IF(سفارشات!H406<>0,سفارشات!D406,\"\")","v":""},{"$f":"IF(سفارشات!H406<>0,سفارشات!E406,\"\")","v":""},{"$f":"IF(سفارشات!H406<>0,سفارشات!F406,\"\")","v":""},{"$f":"IF(C408=\"\",\"\",E408-F408)","v":""}]
[{"$f":"IF(C409=\"\",\"\",ROW()-ROW($A$3))","v":""},{"$f":"IF(سفارشات!H407<>0,سفارشات!C407,\"\")","v":""},{"$f":"IF(سفارشات!H407<>0,سفارشات!B407,\"\")","v":""},{"$f":"IF(سفارشات!H407<>0,سفارشات!D407,\"\")","v":""},{"$f":"IF(سفارشات!H407<>0,سفارشات!E407,\"\")","v":""},{"$f":"IF(سفارشات!H407<>0,سفارشات!F407,\"\")","v":""},{"$f":"IF(C409=\"\",\"\",E409-F409)","v":""}]
[{"$f":"IF(C410=\"\",\"\",ROW()-ROW($A$3))","v":""},{"$f":"IF(سفارشات!H408<>0,سفارشات!C408,\"\")","v":""},{"$f":"IF(سفارشات!H408<>0,سفارشات!B408,\"\")","v":""},{"$f":"IF(سفارشات!H408<>0,سفارشات!D408,\"\")","v":""},{"$f":"IF(سفارشات!H408<>0,سفارشات!E408,\"\")","v":""},{"$f":"IF(سفارشات!H408<>0,سفارشات!F408,\"\")","v":""},{"$f":"IF(C410=\"\",\"\",E410-F410)","v":""}]
[{"$f":"IF(C411=\"\",\"\",ROW()-ROW($A$3))","v":""},{"$f":"IF(سفارشات!H409<>0,سفارشات!C409,\"\")","v":""},{"$f":"IF(سفارشات!H409<>0,سفارشات!B409,\"\")","v":""},{"$f":"IF(سفارشات!H409<>0,سفارشات!D409,\"\")","v":""},{"$f":"IF(سفارشات!H409<>0,سفارشات!E409,\"\")","v":""},{"$f":"IF(سفارشات!H409<>0,سفارشات!F409,\"\")","v":""},{"$f":"IF(C411=\"\",\"\",E411-F411)","v":""}]
[{"$f":"IF(C412=\"\",\"\",ROW()-ROW($A$3))","v":""},{"$f":"IF(سفارشات!H410<>0,سفارشات!C410,\"\")","v":""},{"$f":"IF(سفارشات!H410<>0,سفارشات!B410,\"\")","v":""},{"$f":"IF(سفارشات!H410<>0,سفارشات!D410,\"\")","v":""},{"$f":"IF(سفارشات!H410<>0,سفارشات!E410,\"\")","v":""},{"$f":"IF(سفارشات!H410<>0,سفارشات!F410,\"\")","v":""},{"$f":"IF(C412=\"\",\"\",E412-F412)","v":""}]
[{"$f":"IF(C413=\"\",\"\",ROW()-ROW($A$3))","v":""},{"$f":"IF(سفارشات!H411<>0,سفارشات!C411,\"\")","v":""},{"$f":"IF(سفارشات!H411<>0,سفارشات!B411,\"\")","v":""},{"$f":"IF(سفارشات!H411<>0,سفارشات!D411,\"\")","v":""},{"$f":"IF(سفارشات!H411<>0,سفارشات!E411,\"\")","v":""},{"$f":"IF(سفارشات!H411<>0,سفارشات!F411,\"\")","v":""},{"$f":"IF(C413=\"\",\"\",E413-F413)","v":""}]
[{"$f":"IF(C414=\"\",\"\",ROW()-ROW($A$3))","v":""},{"$f":"IF(سفارشات!H412<>0,سفارشات!C412,\"\")","v":""},{"$f":"IF(سفارشات!H412<>0,سفارشات!B412,\"\")","v":""},{"$f":"IF(سفارشات!H412<>0,سفارشات!D412,\"\")","v":""},{"$f":"IF(سفارشات!H412<>0,سفارشات!E412,\"\")","v":""},{"$f":"IF(سفارشات!H412<>0,سفارشات!F412,\"\")","v":""},{"$f":"IF(C414=\"\",\"\",E414-F414)","v":""}]
[{"$f":"IF(C415=\"\",\"\",ROW()-ROW($A$3))","v":""},{"$f":"IF(سفارشات!H413<>0,سفارشات!C413,\"\")","v":""},{"$f":"IF(سفارشات!H413<>0,سفارشات!B413,\"\")","v":""},{"$f":"IF(سفارشات!H413<>0,سفارشات!D413,\"\")","v":""},{"$f":"IF(سفارشات!H413<>0,سفارشات!E413,\"\")","v":""},{"$f":"IF(سفارشات!H413<>0,سفارشات!F413,\"\")","v":""},{"$f":"IF(C415=\"\",\"\",E415-F415)","v":""}]
[{"$f":"IF(C416=\"\",\"\",ROW()-ROW($A$3))","v":""},{"$f":"IF(سفارشات!H414<>0,سفارشات!C414,\"\")","v":""},{"$f":"IF(سفارشات!H414<>0,سفارشات!B414,\"\")","v":""},{"$f":"IF(سفارشات!H414<>0,سفارشات!D414,\"\")","v":""},{"$f":"IF(سفارشات!H414<>0,سفارشات!E414,\"\")","v":""},{"$f":"IF(سفارشات!H414<>0,سفارشات!F414,\"\")","v":""},{"$f":"IF(C416=\"\",\"\",E416-F416)","v":""}]
[{"$f":"IF(C417=\"\",\"\",ROW()-ROW($A$3))","v":""},{"$f":"IF(سفارشات!H415<>0,سفارشات!C415,\"\")","v":""},{"$f":"IF(سفارشات!H415<>0,سفارشات!B415,\"\")","v":""},{"$f":"IF(سفارشات!H415<>0,سفارشات!D415,\"\")","v":""},{"$f":"IF(سفارشات!H415<>0,سفارشات!E415,\"\")","v":""},{"$f":"IF(سفارشات!H415<>0,سفارشات!F415,\"\")","v":""},{"$f":"IF(C417=\"\",\"\",E417-F417)","v":""}]
[{"$f":"IF(C418=\"\",\"\",ROW()-ROW($A$3))","v":""},{"$f":"IF(سفارشات!H416<>0,سفارشات!C416,\"\")","v":""},{"$f":"IF(سفارشات!H416<>0,سفارشات!B416,\"\")","v":""},{"$f":"IF(سفارشات!H416<>0,سفارشات!D416,\"\")","v":""},{"$f":"IF(سفارشات!H416<>0,سفارشات!E416,\"\")","v":""},{"$f":"IF(سفارشات!H416<>0,سفارشات!F416,\"\")","v":""},{"$f":"IF(C418=\"\",\"\",E418-F418)","v":""}]
[{"$f":"IF(C419=\"\",\"\",ROW()-ROW($A$3))","v":""},{"$f":"IF(سفارشات!H417<>0,سفارشات!C417,\"\")","v":""},{"$f":"IF(سفارشات!H417<>0,سفارشات!B417,\"\")","v":""},{"$f":"IF(سفارشات!H417<>0,سفارشات!D417,\"\")","v":""},{"$f":"IF(سفارشات!H417<>0,سفارشات!E417,\"\")","v":""},{"$f":"IF(سفارشات!H417<>0,سفارشات!F417,\"\")","v":""},{"$f":"IF(C419=\"\",\"\",E419-F419)","v":""}]
[{"$f":"IF(C420=\"\",\"\",ROW()-ROW($A$3))","v":""},{"$f":"IF(سفارشات!H418<>0,سفارشات!C418,\"\")","v":""},{"$f":"IF(سفارشات!H418<>0,سفارشات!B418,\"\")","v":""},{"$f":"IF(سفارشات!H418<>0,سفارشات!D418,\"\")","v":""},{"$f":"IF(سفارشات!H418<>0,سفارشات!E418,\"\")","v":""},{"$f":"IF(سفارشات!H418<>0,سفارشات!F418,\"\")","v":""},{"$f":"IF(C420=\"\",\"\",E420-F420)","v":""}]
[{"$f":"IF(C421=\"\",\"\",ROW()-ROW($A$3))","v":""},{"$f":"IF(سفارشات!H419<>0,سفارشات!C419,\"\")","v":""},{"$f":"IF(سفارشات!H419<>0,سفارشات!B419,\"\")","v":""},{"$f":"IF(سفارشات!H419<>0,سفارشات!D419,\"\")","v":""},{"$f":"IF(سفارشات!H419<>0,سفارشات!E419,\"\")","v":""},{"$f":"IF(سفارشات!H419<>0,سفارشات!F419,\"\")","v":""},{"$f":"IF(C421=\"\",\"\",E421-F421)","v":""}]
[{"$f":"IF(C422=\"\",\"\",ROW()-ROW($A$3))","v":""},{"$f":"IF(سفارشات!H420<>0,سفارشات!C420,\"\")","v":""},{"$f":"IF(سفارشات!H420<>0,سفارشات!B420,\"\")","v":""},{"$f":"IF(سفارشات!H420<>0,سفارشات!D420,\"\")","v":""},{"$f":"IF(سفارشات!H420<>0,سفارشات!E420,\"\")","v":""},{"$f":"IF(سفارشات!H420<>0,سفارشات!F420,\"\")","v":""},{"$f":"IF(C422=\"\",\"\",E422-F422)","v":""}]
[{"$f":"IF(C423=\"\",\"\",ROW()-ROW($A$3))","v":""},{"$f":"IF(سفارشات!H421<>0,سفارشات!C421,\"\")","v":""},{"$f":"IF(سفارشات!H421<>0,سفارشات!B421,\"\")","v":""},{"$f":"IF(سفارشات!H421<>0,سفارشات!D421,\"\")","v":""},{"$f":"IF(سفارشات!H421<>0,سفارشات!E421,\"\")","v":""},{"$f":"IF(سفارشات!H421<>0,سفارشات!F421,\"\")","v":""},{"$f":"IF(C423=\"\",\"\",E423-F423)","v":""}]
[{"$f":"IF(C424=\"\",\"\",ROW()-ROW($A$3))","v":""},{"$f":"IF(سفارشات!H422<>0,سفارشات!C422,\"\")","v":""},{"$f":"IF(سفارشات!H422<>0,سفارشات!B422,\"\")","v":""},{"$f":"IF(سفارشات!H422<>0,سفارشات!D422,\"\")","v":""},{"$f":"IF(سفارشات!H422<>0,سفارشات!E422,\"\")","v":""},{"$f":"IF(سفارشات!H422<>0,سفارشات!F422,\"\")","v":""},{"$f":"IF(C424=\"\",\"\",E424-F424)","v":""}]
[{"$f":"IF(C425=\"\",\"\",ROW()-ROW($A$3))","v":""},{"$f":"IF(سفارشات!H423<>0,سفارشات!C423,\"\")","v":""},{"$f":"IF(سفارشات!H423<>0,سفارشات!B423,\"\")","v":""},{"$f":"IF(سفارشات!H423<>0,سفارشات!D423,\"\")","v":""},{"$f":"IF(سفارشات!H423<>0,سفارشات!E423,\"\")","v":""},{"$f":"IF(سفارشات!H423<>0,سفارشات!F423,\"\")","v":""},{"$f":"IF(C425=\"\",\"\",E425-F425)","v":""}]
[{"$f":"IF(C426=\"\",\"\",ROW()-ROW($A$3))","v":""},{"$f":"IF(سفارشات!H424<>0,سفارشات!C424,\"\")","v":""},{"$f":"IF(سفارشات!H424<>0,سفارشات!B424,\"\")","v":""},{"$f":"IF(سفارشات!H424<>0,سفارشات!D424,\"\")","v":""},{"$f":"IF(سفارشات!H424<>0,سفارشات!E424,\"\")","v":""},{"$f":"IF(سفارشات!H424<>0,سفارشات!F424,\"\")","v":""},{"$f":"IF(C426=\"\",\"\",E426-F426)","v":""}]
[{"$f":"IF(C427=\"\",\"\",ROW()-ROW($A$3))","v":""},{"$f":"IF(سفارشات!H425<>0,سفارشات!C425,\"\")","v":""},{"$f":"IF(سفارشات!H425<>0,سفارشات!B425,\"\")","v":""},{"$f":"IF(سفارشات!H425<>0,سفارشات!D425,\"\")","v":""},{"$f":"IF(سفارشات!H425<>0,سفارشات!E425,\"\")","v":""},{"$f":"IF(سفارشات!H425<>0,سفارشات!F425,\"\")","v":""},{"$f":"IF(C427=\"\",\"\",E427-F427)","v":""}]
[{"$f":"IF(C428=\"\",\"\",ROW()-ROW($A$3))","v":""},{"$f":"IF(سفارشات!H426<>0,سفارشات!C426,\"\")","v":""},{"$f":"IF(سفارشات!H426<>0,سفارشات!B426,\"\")","v":""},{"$f":"IF(سفارشات!H426<>0,سفارشات!D426,\"\")","v":""},{"$f":"IF(سفارشات!H426<>0,سفارشات!E426,\"\")","v":""},{"$f":"IF(سفارشات!H426<>0,سفارشات!F426,\"\")","v":""},{"$f":"IF(C428=\"\",\"\",E428-F428)","v":""}]
[{"$f":"IF(C429=\"\",\"\",ROW()-ROW($A$3))","v":""},{"$f":"IF(سفارشات!H427<>0,سفارشات!C427,\"\")","v":""},{"$f":"IF(سفارشات!H427<>0,سفارشات!B427,\"\")","v":""},{"$f":"IF(سفارشات!H427<>0,سفارشات!D427,\"\")","v":""},{"$f":"IF(سفارشات!H427<>0,سفارشات!E427,\"\")","v":""},{"$f":"IF(سفارشات!H427<>0,سفارشات!F427,\"\")","v":""},{"$f":"IF(C429=\"\",\"\",E429-F429)","v":""}]
[{"$f":"IF(C430=\"\",\"\",ROW()-ROW($A$3))","v":""},{"$f":"IF(سفارشات!H428<>0,سفارشات!C428,\"\")","v":""},{"$f":"IF(سفارشات!H428<>0,سفارشات!B428,\"\")","v":""},{"$f":"IF(سفارشات!H428<>0,سفارشات!D428,\"\")","v":""},{"$f":"IF(سفارشات!H428<>0,سفارشات!E428,\"\")","v":""},{"$f":"IF(سفارشات!H428<>0,سفارشات!F428,\"\")","v":""},{"$f":"IF(C430=\"\",\"\",E430-F430)","v":""}]
[{"$f":"IF(C431=\"\",\"\",ROW()-ROW($A$3))","v":""},{"$f":"IF(سفارشات!H429<>0,سفارشات!C429,\"\")","v":""},{"$f":"IF(سفارشات!H429<>0,سفارشات!B429,\"\")","v":""},{"$f":"IF(سفارشات!H429<>0,سفارشات!D429,\"\")","v":""},{"$f":"IF(سفارشات!H429<>0,سفارشات!E429,\"\")","v":""},{"$f":"IF(سفارشات!H429<>0,سفارشات!F429,\"\")","v":""},{"$f":"IF(C431=\"\",\"\",E431-F431)","v":""}]
[{"$f":"IF(C432=\"\",\"\",ROW()-ROW($A$3))","v":""},{"$f":"IF(سفارشات!H430<>0,سفارشات!C430,\"\")","v":""},{"$f":"IF(سفارشات!H430<>0,سفارشات!B430,\"\")","v":""},{"$f":"IF(سفارشات!H430<>0,سفارشات!D430,\"\")","v":""},{"$f":"IF(سفارشات!H430<>0,سفارشات!E430,\"\")","v":""},{"$f":"IF(سفارشات!H430<>0,سفارشات!F430,\"\")","v":""},{"$f":"IF(C432=\"\",\"\",E432-F432)","v":""}]
[{"$f":"IF(C433=\"\",\"\",ROW()-ROW($A$3))","v":""},{"$f":"IF(سفارشات!H431<>0,سفارشات!C431,\"\")","v":""},{"$f":"IF(سفارشات!H431<>0,سفارشات!B431,\"\")","v":""},{"$f":"IF(سفارشات!H431<>0,سفارشات!D431,\"\")","v":""},{"$f":"IF(سفارشات!H431<>0,سفارشات!E431,\"\")","v":""},{"$f":"IF(سفارشات!H431<>0,سفارشات!F431,\"\")","v":""},{"$f":"IF(C433=\"\",\"\",E433-F433)","v":""}]
[{"$f":"IF(C434=\"\",\"\",ROW()-ROW($A$3))","v":""},{"$f":"IF(سفارشات!H432<>0,سفارشات!C432,\"\")","v":""},{"$f":"IF(سفارشات!H432<>0,سفارشات!B432,\"\")","v":""},{"$f":"IF(سفارشات!H432<>0,سفارشات!D432,\"\")","v":""},{"$f":"IF(سفارشات!H432<>0,سفارشات!E432,\"\")","v":""},{"$f":"IF(سفارشات!H432<>0,سفارشات!F432,\"\")","v":""},{"$f":"IF(C434=\"\",\"\",E434-F434)","v":""}]
[{"$f":"IF(C435=\"\",\"\",ROW()-ROW($A$3))","v":""},{"$f":"IF(سفارشات!H433<>0,سفارشات!C433,\"\")","v":""},{"$f":"IF(سفارشات!H433<>0,سفارشات!B433,\"\")","v":""},{"$f":"IF(سفارشات!H433<>0,سفارشات!D433,\"\")","v":""},{"$f":"IF(سفارشات!H433<>0,سفارشات!E433,\"\")","v":""},{"$f":"IF(سفارشات!H433<>0,سفارشات!F433,\"\")","v":""},{"$f":"IF(C435=\"\",\"\",E435-F435)","v":""}]
[{"$f":"IF(C436=\"\",\"\",ROW()-ROW($A$3))","v":""},{"$f":"IF(سفارشات!H434<>0,سفارشات!C434,\"\")","v":""},{"$f":"IF(سفارشات!H434<>0,سفارشات!B434,\"\")","v":""},{"$f":"IF(سفارشات!H434<>0,سفارشات!D434,\"\")","v":""},{"$f":"IF(سفارشات!H434<>0,سفارشات!E434,\"\")","v":""},{"$f":"IF(سفارشات!H434<>0,سفارشات!F434,\"\")","v":""},{"$f":"IF(C436=\"\",\"\",E436-F436)","v":""}]
[{"$f":"IF(C437=\"\",\"\",ROW()-ROW($A$3))","v":""},{"$f":"IF(سفارشات!H435<>0,سفارشات!C435,\"\")","v":""},{"$f":"IF(سفارشات!H435<>0,سفارشات!B435,\"\")","v":""},{"$f":"IF(سفارشات!H435<>0,سفارشات!D435,\"\")","v":""},{"$f":"IF(سفارشات!H435<>0,سفارشات!E435,\"\")","v":""},{"$f":"IF(سفارشات!H435<>0,سفارشات!F435,\"\")","v":""},{"$f":"IF(C437=\"\",\"\",E437-F437)","v":""}]
[{"$f":"IF(C438=\"\",\"\",ROW()-ROW($A$3))","v":""},{"$f":"IF(سفارشات!H436<>0,سفارشات!C436,\"\")","v":""},{"$f":"IF(سفارشات!H436<>0,سفارشات!B436,\"\")","v":""},{"$f":"IF(سفارشات!H436<>0,سفارشات!D436,\"\")","v":""},{"$f":"IF(سفارشات!H436<>0,سفارشات!E436,\"\")","v":""},{"$f":"IF(سفارشات!H436<>0,سفارشات!F436,\"\")","v":""},{"$f":"IF(C438=\"\",\"\",E438-F438)","v":""}]
[{"$f":"IF(C439=\"\",\"\",ROW()-ROW($A$3))","v":""},{"$f":"IF(سفارشات!H437<>0,سفارشات!C437,\"\")","v":""},{"$f":"IF(سفارشات!H437<>0,سفارشات!B437,\"\")","v":""},{"$f":"IF(سفارشات!H437<>0,سفارشات!D437,\"\")","v":""},{"$f":"IF(سفارشات!H437<>0,سفارشات!E437,\"\")","v":""},{"$f":"IF(سفارشات!H437<>0,سفارشات!F437,\"\")","v":""},{"$f":"IF(C439=\"\",\"\",E439-F439)","v":""}]
[{"$f":"IF(C440=\"\",\"\",ROW()-ROW($A$3))","v":""},{"$f":"IF(سفارشات!H438<>0,سفارشات!C438,\"\")","v":""},{"$f":"IF(سفارشات!H438<>0,سفارشات!B438,\"\")","v":""},{"$f":"IF(سفارشات!H438<>0,سفارشات!D438,\"\")","v":""},{"$f":"IF(سفارشات!H438<>0,سفارشات!E438,\"\")","v":""},{"$f":"IF(سفارشات!H438<>0,سفارشات!F438,\"\")","v":""},{"$f":"IF(C440=\"\",\"\",E440-F440)","v":""}]
[{"$f":"IF(C441=\"\",\"\",ROW()-ROW($A$3))","v":""},{"$f":"IF(سفارشات!H439<>0,سفارشات!C439,\"\")","v":""},{"$f":"IF(سفارشات!H439<>0,سفارشات!B439,\"\")","v":""},{"$f":"IF(سفارشات!H439<>0,سفارشات!D439,\"\")","v":""},{"$f":"IF(سفارشات!H439<>0,سفارشات!E439,\"\")","v":""},{"$f":"IF(سفارشات!H439<>0,سفارشات!F439,\"\")","v":""},{"$f":"IF(C441=\"\",\"\",E441-F441)","v":""}]
[{"$f":"IF(C442=\"\",\"\",ROW()-ROW($A$3))","v":""},{"$f":"IF(سفارشات!H440<>0,سفارشات!C440,\"\")","v":""},{"$f":"IF(سفارشات!H440<>0,سفارشات!B440,\"\")","v":""},{"$f":"IF(سفارشات!H440<>0,سفارشات!D440,\"\")","v":""},{"$f":"IF(سفارشات!H440<>0,سفارشات!E440,\"\")","v":""},{"$f":"IF(سفارشات!H440<>0,سفارشات!F440,\"\")","v":""},{"$f":"IF(C442=\"\",\"\",E442-F442)","v":""}]
[{"$f":"IF(C443=\"\",\"\",ROW()-ROW($A$3))","v":""},{"$f":"IF(سفارشات!H441<>0,سفارشات!C441,\"\")","v":""},{"$f":"IF(سفارشات!H441<>0,سفارشات!B441,\"\")","v":""},{"$f":"IF(سفارشات!H441<>0,سفارشات!D441,\"\")","v":""},{"$f":"IF(سفارشات!H441<>0,سفارشات!E441,\"\")","v":""},{"$f":"IF(سفارشات!H441<>0,سفارشات!F441,\"\")","v":""},{"$f":"IF(C443=\"\",\"\",E443-F443)","v":""}]
[{"$f":"IF(C444=\"\",\"\",ROW()-ROW($A$3))","v":""},{"$f":"IF(سفارشات!H442<>0,سفارشات!C442,\"\")","v":""},{"$f":"IF(سفارشات!H442<>0,سفارشات!B442,\"\")","v":""},{"$f":"IF(سفارشات!H442<>0,سفارشات!D442,\"\")","v":""},{"$f":"IF(سفارشات!H442<>0,سفارشات!E442,\"\")","v":""},{"$f":"IF(سفارشات!H442<>0,سفارشات!F442,\"\")","v":""},{"$f":"IF(C444=\"\",\"\",E444-F444)","v":""}]
[{"$f":"IF(C445=\"\",\"\",ROW()-ROW($A$3))","v":""},{"$f":"IF(سفارشات!H443<>0,سفارشات!C443,\"\")","v":""},{"$f":"IF(سفارشات!H443<>0,سفارشات!B443,\"\")","v":""},{"$f":"IF(سفارشات!H443<>0,سفارشات!D443,\"\")","v":""},{"$f":"IF(سفارشات!H443<>0,سفارشات!E443,\"\")","v":""},{"$f":"IF(سفارشات!H443<>0,سفارشات!F443,\"\")","v":""},{"$f":"IF(C445=\"\",\"\",E445-F445)","v":""}]
[{"$f":"IF(C446=\"\",\"\",ROW()-ROW($A$3))","v":""},{"$f":"IF(سفارشات!H444<>0,سفارشات!C444,\"\")","v":""},{"$f":"IF(سفارشات!H444<>0,سفارشات!B444,\"\")","v":""},{"$f":"IF(سفارشات!H444<>0,سفارشات!D444,\"\")","v":""},{"$f":"IF(سفارشات!H444<>0,سفارشات!E444,\"\")","v":""},{"$f":"IF(سفارشات!H444<>0,سفارشات!F444,\"\")","v":""},{"$f":"IF(C446=\"\",\"\",E446-F446)","v":""}]
[{"$f":"IF(C447=\"\",\"\",ROW()-ROW($A$3))","v":""},{"$f":"IF(سفارشات!H445<>0,سفارشات!C445,\"\")","v":""},{"$f":"IF(سفارشات!H445<>0,سفارشات!B445,\"\")","v":""},{"$f":"IF(سفارشات!H445<>0,سفارشات!D445,\"\")","v":""},{"$f":"IF(سفارشات!H445<>0,سفارشات!E445,\"\")","v":""},{"$f":"IF(سفارشات!H445<>0,سفارشات!F445,\"\")","v":""},{"$f":"IF(C447=\"\",\"\",E447-F447)","v":""}]
[{"$f":"IF(C448=\"\",\"\",ROW()-ROW($A$3))","v":""},{"$f":"IF(سفارشات!H446<>0,سفارشات!C446,\"\")","v":""},{"$f":"IF(سفارشات!H446<>0,سفارشات!B446,\"\")","v":""},{"$f":"IF(سفارشات!H446<>0,سفارشات!D446,\"\")","v":""},{"$f":"IF(سفارشات!H446<>0,سفارشات!E446,\"\")","v":""},{"$f":"IF(سفارشات!H446<>0,سفارشات!F446,\"\")","v":""},{"$f":"IF(C448=\"\",\"\",E448-F448)","v":""}]
[{"$f":"IF(C449=\"\",\"\",ROW()-ROW($A$3))","v":""},{"$f":"IF(سفارشات!H447<>0,سفارشات!C447,\"\")","v":""},{"$f":"IF(سفارشات!H447<>0,سفارشات!B447,\"\")","v":""},{"$f":"IF(سفارشات!H447<>0,سفارشات!D447,\"\")","v":""},{"$f":"IF(سفارشات!H447<>0,سفارشات!E447,\"\")","v":""},{"$f":"IF(سفارشات!H447<>0,سفارشات!F447,\"\")","v":""},{"$f":"IF(C449=\"\",\"\",E449-F449)","v":""}]
[{"$f":"IF(C450=\"\",\"\",ROW()-ROW($A$3))","v":""},{"$f":"IF(سفارشات!H448<>0,سفارشات!C448,\"\")","v":""},{"$f":"IF(سفارشات!H448<>0,سفارشات!B448,\"\")","v":""},{"$f":"IF(سفارشات!H448<>0,سفارشات!D448,\"\")","v":""},{"$f":"IF(سفارشات!H448<>0,سفارشات!E448,\"\")","v":""},{"$f":"IF(سفارشات!H448<>0,سفارشات!F448,\"\")","v":""},{"$f":"IF(C450=\"\",\"\",E450-F450)","v":""}]
[{"$f":"IF(C451=\"\",\"\",ROW()-ROW($A$3))","v":""},{"$f":"IF(سفارشات!H449<>0,سفارشات!C449,\"\")","v":""},{"$f":"IF(سفارشات!H449<>0,سفارشات!B449,\"\")","v":""},{"$f":"IF(سفارشات!H449<>0,سفارشات!D449,\"\")","v":""},{"$f":"IF(سفارشات!H449<>0,سفارشات!E449,\"\")","v":""},{"$f":"IF(سفارشات!H449<>0,سفارشات!F449,\"\")","v":""},{"$f":"IF(C451=\"\",\"\",E451-F451)","v":""}]
[{"$f":"IF(C452=\"\",\"\",ROW()-ROW($A$3))","v":""},{"$f":"IF(سفارشات!H450<>0,سفارشات!C450,\"\")","v":""},{"$f":"IF(سفارشات!H450<>0,سفارشات!B450,\"\")","v":""},{"$f":"IF(سفارشات!H450<>0,سفارشات!D450,\"\")","v":""},{"$f":"IF(سفارشات!H450<>0,سفارشات!E450,\"\")","v":""},{"$f":"IF(سفارشات!H450<>0,سفارشات!F450,\"\")","v":""},{"$f":"IF(C452=\"\",\"\",E452-F452)","v":""}]
[{"$f":"IF(C453=\"\",\"\",ROW()-ROW($A$3))","v":""},{"$f":"IF(سفارشات!H451<>0,سفارشات!C451,\"\")","v":""},{"$f":"IF(سفارشات!H451<>0,سفارشات!B451,\"\")","v":""},{"$f":"IF(سفارشات!H451<>0,سفارشات!D451,\"\")","v":""},{"$f":"IF(سفارشات!H451<>0,سفارشات!E451,\"\")","v":""},{"$f":"IF(سفارشات!H451<>0,سفارشات!F451,\"\")","v":""},{"$f":"IF(C453=\"\",\"\",E453-F453)","v":""}]
[{"$f":"IF(C454=\"\",\"\",ROW()-ROW($A$3))","v":""},{"$f":"IF(سفارشات!H452<>0,سفارشات!C452,\"\")","v":""},{"$f":"IF(سفارشات!H452<>0,سفارشات!B452,\"\")","v":""},{"$f":"IF(سفارشات!H452<>0,سفارشات!D452,\"\")","v":""},{"$f":"IF(سفارشات!H452<>0,سفارشات!E452,\"\")","v":""},{"$f":"IF(سفارشات!H452<>0,سفارشات!F452,\"\")","v":""},{"$f":"IF(C454=\"\",\"\",E454-F454)","v":""}]
[{"$f":"IF(C455=\"\",\"\",ROW()-ROW($A$3))","v":""},{"$f":"IF(سفارشات!H453<>0,سفارشات!C453,\"\")","v":""},{"$f":"IF(سفارشات!H453<>0,سفارشات!B453,\"\")","v":""},{"$f":"IF(سفارشات!H453<>0,سفارشات!D453,\"\")","v":""},{"$f":"IF(سفارشات!H453<>0,سفارشات!E453,\"\")","v":""},{"$f":"IF(سفارشات!H453<>0,سفارشات!F453,\"\")","v":""},{"$f":"IF(C455=\"\",\"\",E455-F455)","v":""}]
[{"$f":"IF(C456=\"\",\"\",ROW()-ROW($A$3))","v":""},{"$f":"IF(سفارشات!H454<>0,سفارشات!C454,\"\")","v":""},{"$f":"IF(سفارشات!H454<>0,سفارشات!B454,\"\")","v":""},{"$f":"IF(سفارشات!H454<>0,سفارشات!D454,\"\")","v":""},{"$f":"IF(سفارشات!H454<>0,سفارشات!E454,\"\")","v":""},{"$f":"IF(سفارشات!H454<>0,سفارشات!F454,\"\")","v":""},{"$f":"IF(C456=\"\",\"\",E456-F456)","v":""}]
[{"$f":"IF(C457=\"\",\"\",ROW()-ROW($A$3))","v":""},{"$f":"IF(سفارشات!H455<>0,سفارشات!C455,\"\")","v":""},{"$f":"IF(سفارشات!H455<>0,سفارشات!B455,\"\")","v":""},{"$f":"IF(سفارشات!H455<>0,سفارشات!D455,\"\")","v":""},{"$f":"IF(سفارشات!H455<>0,سفارشات!E455,\"\")","v":""},{"$f":"IF(سفارشات!H455<>0,سفارشات!F455,\"\")","v":""},{"$f":"IF(C457=\"\",\"\",E457-F457)","v":""}]
[{"$f":"IF(C458=\"\",\"\",ROW()-ROW($A$3))","v":""},{"$f":"IF(سفارشات!H456<>0,سفارشات!C456,\"\")","v":""},{"$f":"IF(سفارشات!H456<>0,سفارشات!B456,\"\")","v":""},{"$f":"IF(سفارشات!H456<>0,سفارشات!D456,\"\")","v":""},{"$f":"IF(سفارشات!H456<>0,سفارشات!E456,\"\")","v":""},{"$f":"IF(سفارشات!H456<>0,سفارشات!F456,\"\")","v":""},{"$f":"IF(C458=\"\",\"\",E458-F458)","v":""}]
[{"$f":"IF(C459=\"\",\"\",ROW()-ROW($A$3))","v":""},{"$f":"IF(سفارشات!H457<>0,سفارشات!C457,\"\")","v":""},{"$f":"IF(سفارشات!H457<>0,سفارشات!B457,\"\")","v":""},{"$f":"IF(سفارشات!H457<>0,سفارشات!D457,\"\")","v":""},{"$f":"IF(سفارشات!H457<>0,سفارشات!E457,\"\")","v":""},{"$f":"IF(سفارشات!H457<>0,سفارشات!F457,\"\")","v":""},{"$f":"IF(C459=\"\",\"\",E459-F459)","v":""}]
[{"$f":"IF(C460=\"\",\"\",ROW()-ROW($A$3))","v":""},{"$f":"IF(سفارشات!H458<>0,سفارشات!C458,\"\")","v":""},{"$f":"IF(سفارشات!H458<>0,سفارشات!B458,\"\")","v":""},{"$f":"IF(سفارشات!H458<>0,سفارشات!D458,\"\")","v":""},{"$f":"IF(سفارشات!H458<>0,سفارشات!E458,\"\")","v":""},{"$f":"IF(سفارشات!H458<>0,سفارشات!F458,\"\")","v":""},{"$f":"IF(C460=\"\",\"\",E460-F460)","v":""}]
[{"$f":"IF(C461=\"\",\"\",ROW()-ROW($A$3))","v":""},{"$f":"IF(سفارشات!H459<>0,سفارشات!C459,\"\")","v":""},{"$f":"IF(سفارشات!H459<>0,سفارشات!B459,\"\")","v":""},{"$f":"IF(سفارشات!H459<>0,سفارشات!D459,\"\")","v":""},{"$f":"IF(سفارشات!H459<>0,سفارشات!E459,\"\")","v":""},{"$f":"IF(سفارشات!H459<>0,سفارشات!F459,\"\")","v":""},{"$f":"IF(C461=\"\",\"\",E461-F461)","v":""}]
[{"$f":"IF(C462=\"\",\"\",ROW()-ROW($A$3))","v":""},{"$f":"IF(سفارشات!H460<>0,سفارشات!C460,\"\")","v":""},{"$f":"IF(سفارشات!H460<>0,سفارشات!B460,\"\")","v":""},{"$f":"IF(سفارشات!H460<>0,سفارشات!D460,\"\")","v":""},{"$f":"IF(سفارشات!H460<>0,سفارشات!E460,\"\")","v":""},{"$f":"IF(سفارشات!H460<>0,سفارشات!F460,\"\")","v":""},{"$f":"IF(C462=\"\",\"\",E462-F462)","v":""}]
[{"$f":"IF(C463=\"\",\"\",ROW()-ROW($A$3))","v":""},{"$f":"IF(سفارشات!H461<>0,سفارشات!C461,\"\")","v":""},{"$f":"IF(سفارشات!H461<>0,سفارشات!B461,\"\")","v":""},{"$f":"IF(سفارشات!H461<>0,سفارشات!D461,\"\")","v":""},{"$f":"IF(سفارشات!H461<>0,سفارشات!E461,\"\")","v":""},{"$f":"IF(سفارشات!H461<>0,سفارشات!F461,\"\")","v":""},{"$f":"IF(C463=\"\",\"\",E463-F463)","v":""}]
[{"$f":"IF(C464=\"\",\"\",ROW()-ROW($A$3))","v":""},{"$f":"IF(سفارشات!H462<>0,سفارشات!C462,\"\")","v":""},{"$f":"IF(سفارشات!H462<>0,سفارشات!B462,\"\")","v":""},{"$f":"IF(سفارشات!H462<>0,سفارشات!D462,\"\")","v":""},{"$f":"IF(سفارشات!H462<>0,سفارشات!E462,\"\")","v":""},{"$f":"IF(سفارشات!H462<>0,سفارشات!F462,\"\")","v":""},{"$f":"IF(C464=\"\",\"\",E464-F464)","v":""}]
[{"$f":"IF(C465=\"\",\"\",ROW()-ROW($A$3))","v":""},{"$f":"IF(سفارشات!H463<>0,سفارشات!C463,\"\")","v":""},{"$f":"IF(سفارشات!H463<>0,سفارشات!B463,\"\")","v":""},{"$f":"IF(سفارشات!H463<>0,سفارشات!D463,\"\")","v":""},{"$f":"IF(سفارشات!H463<>0,سفارشات!E463,\"\")","v":""},{"$f":"IF(سفارشات!H463<>0,سفارشات!F463,\"\")","v":""},{"$f":"IF(C465=\"\",\"\",E465-F465)","v":""}]
[{"$f":"IF(C466=\"\",\"\",ROW()-ROW($A$3))","v":""},{"$f":"IF(سفارشات!H464<>0,سفارشات!C464,\"\")","v":""},{"$f":"IF(سفارشات!H464<>0,سفارشات!B464,\"\")","v":""},{"$f":"IF(سفارشات!H464<>0,سفارشات!D464,\"\")","v":""},{"$f":"IF(سفارشات!H464<>0,سفارشات!E464,\"\")","v":""},{"$f":"IF(سفارشات!H464<>0,سفارشات!F464,\"\")","v":""},{"$f":"IF(C466=\"\",\"\",E466-F466)","v":""}]
[{"$f":"IF(C467=\"\",\"\",ROW()-ROW($A$3))","v":""},{"$f":"IF(سفارشات!H465<>0,سفارشات!C465,\"\")","v":""},{"$f":"IF(سفارشات!H465<>0,سفارشات!B465,\"\")","v":""},{"$f":"IF(سفارشات!H465<>0,سفارشات!D465,\"\")","v":""},{"$f":"IF(سفارشات!H465<>0,سفارشات!E465,\"\")","v":""},{"$f":"IF(سفارشات!H465<>0,سفارشات!F465,\"\")","v":""},{"$f":"IF(C467=\"\",\"\",E467-F467)","v":""}]
[{"$f":"IF(C468=\"\",\"\",ROW()-ROW($A$3))","v":""},{"$f":"IF(سفارشات!H466<>0,سفارشات!C466,\"\")","v":""},{"$f":"IF(سفارشات!H466<>0,سفارشات!B466,\"\")","v":""},{"$f":"IF(سفارشات!H466<>0,سفارشات!D466,\"\")","v":""},{"$f":"IF(سفارشات!H466<>0,سفارشات!E466,\"\")","v":""},{"$f":"IF(سفارشات!H466<>0,سفارشات!F466,\"\")","v":""},{"$f":"IF(C468=\"\",\"\",E468-F468)","v":""}]
[{"$f":"IF(C469=\"\",\"\",ROW()-ROW($A$3))","v":""},{"$f":"IF(سفارشات!H467<>0,سفارشات!C467,\"\")","v":""},{"$f":"IF(سفارشات!H467<>0,سفارشات!B467,\"\")","v":""},{"$f":"IF(سفارشات!H467<>0,سفارشات!D467,\"\")","v":""},{"$f":"IF(سفارشات!H467<>0,سفارشات!E467,\"\")","v":""},{"$f":"IF(سفارشات!H467<>0,سفارشات!F467,\"\")","v":""},{"$f":"IF(C469=\"\",\"\",E469-F469)","v":""}]
[{"$f":"IF(C470=\"\",\"\",ROW()-ROW($A$3))","v":""},{"$f":"IF(سفارشات!H468<>0,سفارشات!C468,\"\")","v":""},{"$f":"IF(سفارشات!H468<>0,سفارشات!B468,\"\")","v":""},{"$f":"IF(سفارشات!H468<>0,سفارشات!D468,\"\")","v":""},{"$f":"IF(سفارشات!H468<>0,سفارشات!E468,\"\")","v":""},{"$f":"IF(سفارشات!H468<>0,سفارشات!F468,\"\")","v":""},{"$f":"IF(C470=\"\",\"\",E470-F470)","v":""}]
[{"$f":"IF(C471=\"\",\"\",ROW()-ROW($A$3))","v":""},{"$f":"IF(سفارشات!H469<>0,سفارشات!C469,\"\")","v":""},{"$f":"IF(سفارشات!H469<>0,سفارشات!B469,\"\")","v":""},{"$f":"IF(سفارشات!H469<>0,سفارشات!D469,\"\")","v":""},{"$f":"IF(سفارشات!H469<>0,سفارشات!E469,\"\")","v":""},{"$f":"IF(سفارشات!H469<>0,سفارشات!F469,\"\")","v":""},{"$f":"IF(C471=\"\",\"\",E471-F471)","v":""}]
[{"$f":"IF(C472=\"\",\"\",ROW()-ROW($A$3))","v":""},{"$f":"IF(سفارشات!H470<>0,سفارشات!C470,\"\")","v":""},{"$f":"IF(سفارشات!H470<>0,سفارشات!B470,\"\")","v":""},{"$f":"IF(سفارشات!H470<>0,سفارشات!D470,\"\")","v":""},{"$f":"IF(سفارشات!H470<>0,سفارشات!E470,\"\")","v":""},{"$f":"IF(سفارشات!H470<>0,سفارشات!F470,\"\")","v":""},{"$f":"IF(C472=\"\",\"\",E472-F472)","v":""}]
[{"$f":"IF(C473=\"\",\"\",ROW()-ROW($A$3))","v":""},{"$f":"IF(سفارشات!H471<>0,سفارشات!C471,\"\")","v":""},{"$f":"IF(سفارشات!H471<>0,سفارشات!B471,\"\")","v":""},{"$f":"IF(سفارشات!H471<>0,سفارشات!D471,\"\")","v":""},{"$f":"IF(سفارشات!H471<>0,سفارشات!E471,\"\")","v":""},{"$f":"IF(سفارشات!H471<>0,سفارشات!F471,\"\")","v":""},{"$f":"IF(C473=\"\",\"\",E473-F473)","v":""}]
[{"$f":"IF(C474=\"\",\"\",ROW()-ROW($A$3))","v":""},{"$f":"IF(سفارشات!H472<>0,سفارشات!C472,\"\")","v":""},{"$f":"IF(سفارشات!H472<>0,سفارشات!B472,\"\")","v":""},{"$f":"IF(سفارشات!H472<>0,سفارشات!D472,\"\")","v":""},{"$f":"IF(سفارشات!H472<>0,سفارشات!E472,\"\")","v":""},{"$f":"IF(سفارشات!H472<>0,سفارشات!F472,\"\")","v":""},{"$f":"IF(C474=\"\",\"\",E474-F474)","v":""}]
[{"$f":"IF(C475=\"\",\"\",ROW()-ROW($A$3))","v":""},{"$f":"IF(سفارشات!H473<>0,سفارشات!C473,\"\")","v":""},{"$f":"IF(سفارشات!H473<>0,سفارشات!B473,\"\")","v":""},{"$f":"IF(سفارشات!H473<>0,سفارشات!D473,\"\")","v":""},{"$f":"IF(سفارشات!H473<>0,سفارشات!E473,\"\")","v":""},{"$f":"IF(سفارشات!H473<>0,سفارشات!F473,\"\")","v":""},{"$f":"IF(C475=\"\",\"\",E475-F475)","v":""}]
[{"$f":"IF(C476=\"\",\"\",ROW()-ROW($A$3))","v":""},{"$f":"IF(سفارشات!H474<>0,سفارشات!C474,\"\")","v":""},{"$f":"IF(سفارشات!H474<>0,سفارشات!B474,\"\")","v":""},{"$f":"IF(سفارشات!H474<>0,سفارشات!D474,\"\")","v":""},{"$f":"IF(سفارشات!H474<>0,سفارشات!E474,\"\")","v":""},{"$f":"IF(سفارشات!H474<>0,سفارشات!F474,\"\")","v":""},{"$f":"IF(C476=\"\",\"\",E476-F476)","v":""}]
[{"$f":"IF(C477=\"\",\"\",ROW()-ROW($A$3))","v":""},{"$f":"IF(سفارشات!H475<>0,سفارشات!C475,\"\")","v":""},{"$f":"IF(سفارشات!H475<>0,سفارشات!B475,\"\")","v":""},{"$f":"IF(سفارشات!H475<>0,سفارشات!D475,\"\")","v":""},{"$f":"IF(سفارشات!H475<>0,سفارشات!E475,\"\")","v":""},{"$f":"IF(سفارشات!H475<>0,سفارشات!F475,\"\")","v":""},{"$f":"IF(C477=\"\",\"\",E477-F477)","v":""}]
[{"$f":"IF(C478=\"\",\"\",ROW()-ROW($A$3))","v":""},{"$f":"IF(سفارشات!H476<>0,سفارشات!C476,\"\")","v":""},{"$f":"IF(سفارشات!H476<>0,سفارشات!B476,\"\")","v":""},{"$f":"IF(سفارشات!H476<>0,سفارشات!D476,\"\")","v":""},{"$f":"IF(سفارشات!H476<>0,سفارشات!E476,\"\")","v":""},{"$f":"IF(سفارشات!H476<>0,سفارشات!F476,\"\")","v":""},{"$f":"IF(C478=\"\",\"\",E478-F478)","v":""}]
[{"$f":"IF(C479=\"\",\"\",ROW()-ROW($A$3))","v":""},{"$f":"IF(سفارشات!H477<>0,سفارشات!C477,\"\")","v":""},{"$f":"IF(سفارشات!H477<>0,سفارشات!B477,\"\")","v":""},{"$f":"IF(سفارشات!H477<>0,سفارشات!D477,\"\")","v":""},{"$f":"IF(سفارشات!H477<>0,سفارشات!E477,\"\")","v":""},{"$f":"IF(سفارشات!H477<>0,سفارشات!F477,\"\")","v":""},{"$f":"IF(C479=\"\",\"\",E479-F479)","v":""}]
[{"$f":"IF(C480=\"\",\"\",ROW()-ROW($A$3))","v":""},{"$f":"IF(سفارشات!H478<>0,سفارشات!C478,\"\")","v":""},{"$f":"IF(سفارشات!H478<>0,سفارشات!B478,\"\")","v":""},{"$f":"IF(سفارشات!H478<>0,سفارشات!D478,\"\")","v":""},{"$f":"IF(سفارشات!H478<>0,سفارشات!E478,\"\")","v":""},{"$f":"IF(سفارشات!H478<>0,سفارشات!F478,\"\")","v":""},{"$f":"IF(C480=\"\",\"\",E480-F480)","v":""}]
[{"$f":"IF(C481=\"\",\"\",ROW()-ROW($A$3))","v":""},{"$f":"IF(سفارشات!H479<>0,سفارشات!C479,\"\")","v":""},{"$f":"IF(سفارشات!H479<>0,سفارشات!B479,\"\")","v":""},{"$f":"IF(سفارشات!H479<>0,سفارشات!D479,\"\")","v":""},{"$f":"IF(سفارشات!H479<>0,سفارشات!E479,\"\")","v":""},{"$f":"IF(سفارشات!H479<>0,سفارشات!F479,\"\")","v":""},{"$f":"IF(C481=\"\",\"\",E481-F481)","v":""}]
[{"$f":"IF(C482=\"\",\"\",ROW()-ROW($A$3))","v":""},{"$f":"IF(سفارشات!H480<>0,سفارشات!C480,\"\")","v":""},{"$f":"IF(سفارشات!H480<>0,سفارشات!B480,\"\")","v":""},{"$f":"IF(سفارشات!H480<>0,سفارشات!D480,\"\")","v":""},{"$f":"IF(سفارشات!H480<>0,سفارشات!E480,\"\")","v":""},{"$f":"IF(سفارشات!H480<>0,سفارشات!F480,\"\")","v":""},{"$f":"IF(C482=\"\",\"\",E482-F482)","v":""}]
[{"$f":"IF(C483=\"\",\"\",ROW()-ROW($A$3))","v":""},{"$f":"IF(سفارشات!H481<>0,سفارشات!C481,\"\")","v":""},{"$f":"IF(سفارشات!H481<>0,سفارشات!B481,\"\")","v":""},{"$f":"IF(سفارشات!H481<>0,سفارشات!D481,\"\")","v":""},{"$f":"IF(سفارشات!H481<>0,سفارشات!E481,\"\")","v":""},{"$f":"IF(سفارشات!H481<>0,سفارشات!F481,\"\")","v":""},{"$f":"IF(C483=\"\",\"\",E483-F483)","v":""}]
[{"$f":"IF(C484=\"\",\"\",ROW()-ROW($A$3))","v":""},{"$f":"IF(سفارشات!H482<>0,سفارشات!C482,\"\")","v":""},{"$f":"IF(سفارشات!H482<>0,سفارشات!B482,\"\")","v":""},{"$f":"IF(سفارشات!H482<>0,سفارشات!D482,\"\")","v":""},{"$f":"IF(سفارشات!H482<>0,سفارشات!E482,\"\")","v":""},{"$f":"IF(سفارشات!H482<>0,سفارشات!F482,\"\")","v":""},{"$f":"IF(C484=\"\",\"\",E484-F484)","v":""}]
[{"$f":"IF(C485=\"\",\"\",ROW()-ROW($A$3))","v":""},{"$f":"IF(سفارشات!H483<>0,سفارشات!C483,\"\")","v":""},{"$f":"IF(سفارشات!H483<>0,سفارشات!B483,\"\")","v":""},{"$f":"IF(سفارشات!H483<>0,سفارشات!D483,\"\")","v":""},{"$f":"IF(سفارشات!H483<>0,سفارشات!E483,\"\")","v":""},{"$f":"IF(سفارشات!H483<>0,سفارشات!F483,\"\")","v":""},{"$f":"IF(C485=\"\",\"\",E485-F485)","v":""}]
[{"$f":"IF(C486=\"\",\"\",ROW()-ROW($A$3))","v":""},{"$f":"IF(سفارشات!H484<>0,سفارشات!C484,\"\")","v":""},{"$f":"IF(سفارشات!H484<>0,سفارشات!B484,\"\")","v":""},{"$f":"IF(سفارشات!H484<>0,سفارشات!D484,\"\")","v":""},{"$f":"IF(سفارشات!H484<>0,سفارشات!E484,\"\")","v":""},{"$f":"IF(سفارشات!H484<>0,سفارشات!F484,\"\")","v":""},{"$f":"IF(C486=\"\",\"\",E486-F486)","v":""}]
[{"$f":"IF(C487=\"\",\"\",ROW()-ROW($A$3))","v":""},{"$f":"IF(سفارشات!H485<>0,سفارشات!C485,\"\")","v":""},{"$f":"IF(سفارشات!H485<>0,سفارشات!B485,\"\")","v":""},{"$f":"IF(سفارشات!H485<>0,سفارشات!D485,\"\")","v":""},{"$f":"IF(سفارشات!H485<>0,سفارشات!E485,\"\")","v":""},{"$f":"IF(سفارشات!H485<>0,سفارشات!F485,\"\")","v":""},{"$f":"IF(C487=\"\",\"\",E487-F487)","v":""}]
[{"$f":"IF(C488=\"\",\"\",ROW()-ROW($A$3))","v":""},{"$f":"IF(سفارشات!H486<>0,سفارشات!C486,\"\")","v":""},{"$f":"IF(سفارشات!H486<>0,سفارشات!B486,\"\")","v":""},{"$f":"IF(سفارشات!H486<>0,سفارشات!D486,\"\")","v":""},{"$f":"IF(سفارشات!H486<>0,سفارشات!E486,\"\")","v":""},{"$f":"IF(سفارشات!H486<>0,سفارشات!F486,\"\")","v":""},{"$f":"IF(C488=\"\",\"\",E488-F488)","v":""}]
[{"$f":"IF(C489=\"\",\"\",ROW()-ROW($A$3))","v":""},{"$f":"IF(سفارشات!H487<>0,سفارشات!C487,\"\")","v":""},{"$f":"IF(سفارشات!H487<>0,سفارشات!B487,\"\")","v":""},{"$f":"IF(سفارشات!H487<>0,سفارشات!D487,\"\")","v":""},{"$f":"IF(سفارشات!H487<>0,سفارشات!E487,\"\")","v":""},{"$f":"IF(سفارشات!H487<>0,سفارشات!F487,\"\")","v":""},{"$f":"IF(C489=\"\",\"\",E489-F489)","v":""}]
[{"$f":"IF(C490=\"\",\"\",ROW()-ROW($A$3))","v":""},{"$f":"IF(سفارشات!H488<>0,سفارشات!C488,\"\")","v":""},{"$f":"IF(سفارشات!H488<>0,سفارشات!B488,\"\")","v":""},{"$f":"IF(سفارشات!H488<>0,سفارشات!D488,\"\")","v":""},{"$f":"IF(سفارشات!H488<>0,سفارشات!E488,\"\")","v":""},{"$f":"IF(سفارشات!H488<>0,سفارشات!F488,\"\")","v":""},{"$f":"IF(C490=\"\",\"\",E490-F490)","v":""}]
[{"$f":"IF(C491=\"\",\"\",ROW()-ROW($A$3))","v":""},{"$f":"IF(سفارشات!H489<>0,سفارشات!C489,\"\")","v":""},{"$f":"IF(سفارشات!H489<>0,سفارشات!B489,\"\")","v":""},{"$f":"IF(سفارشات!H489<>0,سفارشات!D489,\"\")","v":""},{"$f":"IF(سفارشات!H489<>0,سفارشات!E489,\"\")","v":""},{"$f":"IF(سفارشات!H489<>0,سفارشات!F489,\"\")","v":""},{"$f":"IF(C491=\"\",\"\",E491-F491)","v":""}]
[{"$f":"IF(C492=\"\",\"\",ROW()-ROW($A$3))","v":""},{"$f":"IF(سفارشات!H490<>0,سفارشات!C490,\"\")","v":""},{"$f":"IF(سفارشات!H490<>0,سفارشات!B490,\"\")","v":""},{"$f":"IF(سفارشات!H490<>0,سفارشات!D490,\"\")","v":""},{"$f":"IF(سفارشات!H490<>0,سفارشات!E490,\"\")","v":""},{"$f":"IF(سفارشات!H490<>0,سفارشات!F490,\"\")","v":""},{"$f":"IF(C492=\"\",\"\",E492-F492)","v":""}]
[{"$f":"IF(C493=\"\",\"\",ROW()-ROW($A$3))","v":""},{"$f":"IF(سفارشات!H491<>0,سفارشات!C491,\"\")","v":""},{"$f":"IF(سفارشات!H491<>0,سفارشات!B491,\"\")","v":""},{"$f":"IF(سفارشات!H491<>0,سفارشات!D491,\"\")","v":""},{"$f":"IF(سفارشات!H491<>0,سفارشات!E491,\"\")","v":""},{"$f":"IF(سفارشات!H491<>0,سفارشات!F491,\"\")","v":""},{"$f":"IF(C493=\"\",\"\",E493-F493)","v":""}]
[{"$f":"IF(C494=\"\",\"\",ROW()-ROW($A$3))","v":""},{"$f":"IF(سفارشات!H492<>0,سفارشات!C492,\"\")","v":""},{"$f":"IF(سفارشات!H492<>0,سفارشات!B492,\"\")","v":""},{"$f":"IF(سفارشات!H492<>0,سفارشات!D492,\"\")","v":""},{"$f":"IF(سفارشات!H492<>0,سفارشات!E492,\"\")","v":""},{"$f":"IF(سفارشات!H492<>0,سفارشات!F492,\"\")","v":""},{"$f":"IF(C494=\"\",\"\",E494-F494)","v":""}]
[{"$f":"IF(C495=\"\",\"\",ROW()-ROW($A$3))","v":""},{"$f":"IF(سفارشات!H493<>0,سفارشات!C493,\"\")","v":""},{"$f":"IF(سفارشات!H493<>0,سفارشات!B493,\"\")","v":""},{"$f":"IF(سفارشات!H493<>0,سفارشات!D493,\"\")","v":""},{"$f":"IF(سفارشات!H493<>0,سفارشات!E493,\"\")","v":""},{"$f":"IF(سفارشات!H493<>0,سفارشات!F493,\"\")","v":""},{"$f":"IF(C495=\"\",\"\",E495-F495)","v":""}]
[{"$f":"IF(C496=\"\",\"\",ROW()-ROW($A$3))","v":""},{"$f":"IF(سفارشات!H494<>0,سفارشات!C494,\"\")","v":""},{"$f":"IF(سفارشات!H494<>0,سفارشات!B494,\"\")","v":""},{"$f":"IF(سفارشات!H494<>0,سفارشات!D494,\"\")","v":""},{"$f":"IF(سفارشات!H494<>0,سفارشات!E494,\"\")","v":""},{"$f":"IF(سفارشات!H494<>0,سفارشات!F494,\"\")","v":""},{"$f":"IF(C496=\"\",\"\",E496-F496)","v":""}]
[{"$f":"IF(C497=\"\",\"\",ROW()-ROW($A$3))","v":""},{"$f":"IF(سفارشات!H495<>0,سفارشات!C495,\"\")","v":""},{"$f":"IF(سفارشات!H495<>0,سفارشات!B495,\"\")","v":""},{"$f":"IF(سفارشات!H495<>0,سفارشات!D495,\"\")","v":""},{"$f":"IF(سفارشات!H495<>0,سفارشات!E495,\"\")","v":""},{"$f":"IF(سفارشات!H495<>0,سفارشات!F495,\"\")","v":""},{"$f":"IF(C497=\"\",\"\",E497-F497)","v":""}]
[{"$f":"IF(C498=\"\",\"\",ROW()-ROW($A$3))","v":""},{"$f":"IF(سفارشات!H496<>0,سفارشات!C496,\"\")","v":""},{"$f":"IF(سفارشات!H496<>0,سفارشات!B496,\"\")","v":""},{"$f":"IF(سفارشات!H496<>0,سفارشات!D496,\"\")","v":""},{"$f":"IF(سفارشات!H496<>0,سفارشات!E496,\"\")","v":""},{"$f":"IF(سفارشات!H496<>0,سفارشات!F496,\"\")","v":""},{"$f":"IF(C498=\"\",\"\",E498-F498)","v":""}]
[{"$f":"IF(C499=\"\",\"\",ROW()-ROW($A$3))","v":""},{"$f":"IF(سفارشات!H497<>0,سفارشات!C497,\"\")","v":""},{"$f":"IF(سفارشات!H497<>0,سفارشات!B497,\"\")","v":""},{"$f":"IF(سفارشات!H497<>0,سفارشات!D497,\"\")","v":""},{"$f":"IF(سفارشات!H497<>0,سفارشات!E497,\"\")","v":""},{"$f":"IF(سفارشات!H497<>0,سفارشات!F497,\"\")","v":""},{"$f":"IF(C499=\"\",\"\",E499-F499)","v":""}]
[{"$f":"IF(C500=\"\",\"\",ROW()-ROW($A$3))","v":""},{"$f":"IF(سفارشات!H498<>0,سفارشات!C498,\"\")","v":""},{"$f":"IF(سفارشات!H498<>0,سفارشات!B498,\"\")","v":""},{"$f":"IF(سفارشات!H498<>0,سفارشات!D498,\"\")","v":""},{"$f":"IF(سفارشات!H498<>0,سفارشات!E498,\"\")","v":""},{"$f":"IF(سفارشات!H498<>0,سفارشات!F498,\"\")","v":""},{"$f":"IF(C500=\"\",\"\",E500-F500)","v":""}]